[Lsb-autobuild] Build failure for lsblibchk on ppc

lsb-autobuild at freestandards.org lsb-autobuild at freestandards.org
Tue Jul 16 18:35:31 PDT 2002


This is an automated message generated when a build failure occurs

Failed to make packages for lsblibchk
if test ! -e .need_config_update || test 1.2.2.20020717-1 != `cat .need_config_update`; \
  then echo 1.2.2.20020717-1 > .need_config_update; \
fi
sed -e "s#@LSBVERSION@#`echo 1.2.2.20020717`#" -e "s#@PACKAGE_RELEASE@#`echo 1`#" < lsblibchk.spec.sed > lsblibchk.spec
if [ -e /tmp/lsblibchk-1.2.2.20020717 ]; then rm -rf /tmp/lsblibchk-1.2.2.20020717; fi
mkdir -p /tmp/lsblibchk-1.2.2.20020717
cd /tmp/lsblibchk-1.2.2.20020717 && cvs -z9 export -D now src/tests/elfchk
cvs export: failed to open /home/lsbauto/.cvspass for reading: No such file or directory
cvs export: Updating src/tests/elfchk
U src/tests/elfchk/.cvsignore
U src/tests/elfchk/dtneeded.c
U src/tests/elfchk/dynamic.c
U src/tests/elfchk/dynamic.h
U src/tests/elfchk/dynsyms.c
U src/tests/elfchk/dyntags.c
U src/tests/elfchk/elfchk.c
U src/tests/elfchk/elfchk.h
U src/tests/elfchk/genit
U src/tests/elfchk/hdr.c
U src/tests/elfchk/hdr.h
U src/tests/elfchk/makefile
U src/tests/elfchk/mkdtneededlist
U src/tests/elfchk/mkdyntags
U src/tests/elfchk/mkfunclist
U src/tests/elfchk/mkfunclist2
U src/tests/elfchk/mksectinfo
U src/tests/elfchk/proghdr.c
U src/tests/elfchk/proghdr.h
U src/tests/elfchk/proginterp.c
U src/tests/elfchk/sectinfo.c
U src/tests/elfchk/sections.c
U src/tests/elfchk/sections.h
U src/tests/elfchk/symvers.c
U src/tests/elfchk/symvers.h
U src/tests/elfchk/test.c
U src/tests/elfchk/util.c
cd /tmp/lsblibchk-1.2.2.20020717 && cvs -z9 export -D now src/tests/libchk
cvs export: failed to open /home/lsbauto/.cvspass for reading: No such file or directory
cvs export: Updating src/tests/libchk
U src/tests/libchk/.cvsignore
U src/tests/libchk/Artistic
U src/tests/libchk/License.libchk
U src/tests/libchk/README
U src/tests/libchk/ld_lsb_ia64_so_1.c
U src/tests/libchk/ld_lsb_so_1.c
U src/tests/libchk/libGL_so_1.c
U src/tests/libchk/libICE_so_6.c
U src/tests/libchk/libSM_so_6.c
U src/tests/libchk/libX11_so_6.c
U src/tests/libchk/libXext_so_6.c
U src/tests/libchk/libXt_so_6.c
U src/tests/libchk/libc_so_6.c
U src/tests/libchk/libc_so_6_1.c
U src/tests/libchk/libchk.c
U src/tests/libchk/libcrypt_so_1.c
U src/tests/libchk/libdb_so_3.c
U src/tests/libchk/libdl_so_2.c
U src/tests/libchk/libm_so_6.c
U src/tests/libchk/libm_so_6_1.c
U src/tests/libchk/libncurses_so_5.c
U src/tests/libchk/libpthread_so_0.c
U src/tests/libchk/librt_so_1.c
U src/tests/libchk/libs.c
U src/tests/libchk/libs.h
U src/tests/libchk/libs.mk
U src/tests/libchk/libutil_so_1.c
U src/tests/libchk/libz_so_1.c
U src/tests/libchk/lsblibchk.1
U src/tests/libchk/machine_info
U src/tests/libchk/makefile
U src/tests/libchk/mkfunclist
U src/tests/libchk/run_tests
cd /tmp/lsblibchk-1.2.2.20020717 && cvs -z9 export -D now src/tests/tetj
cvs export: failed to open /home/lsbauto/.cvspass for reading: No such file or directory
cvs export: Updating src/tests/tetj
U src/tests/tetj/Makefile
U src/tests/tetj/tetj.c
U src/tests/tetj/tetj.h
cp -pr README Licence Artistic /tmp/lsblibchk-1.2.2.20020717
cp -p Makefile.build /tmp/lsblibchk-1.2.2.20020717/Makefile
cd /tmp/lsblibchk-1.2.2.20020717/.. && tar cvfz /tmp/lsb_autobuild.14486/src/pkgs/lsblibchk/lsblibchk-1.2.2.20020717.tar.gz lsblibchk-1.2.2.20020717
lsblibchk-1.2.2.20020717/
lsblibchk-1.2.2.20020717/src/
lsblibchk-1.2.2.20020717/src/tests/
lsblibchk-1.2.2.20020717/src/tests/elfchk/
lsblibchk-1.2.2.20020717/src/tests/elfchk/.cvsignore
lsblibchk-1.2.2.20020717/src/tests/elfchk/dtneeded.c
lsblibchk-1.2.2.20020717/src/tests/elfchk/dynamic.c
lsblibchk-1.2.2.20020717/src/tests/elfchk/dynamic.h
lsblibchk-1.2.2.20020717/src/tests/elfchk/dynsyms.c
lsblibchk-1.2.2.20020717/src/tests/elfchk/dyntags.c
lsblibchk-1.2.2.20020717/src/tests/elfchk/elfchk.c
lsblibchk-1.2.2.20020717/src/tests/elfchk/elfchk.h
lsblibchk-1.2.2.20020717/src/tests/elfchk/genit
lsblibchk-1.2.2.20020717/src/tests/elfchk/hdr.c
lsblibchk-1.2.2.20020717/src/tests/elfchk/hdr.h
lsblibchk-1.2.2.20020717/src/tests/elfchk/makefile
lsblibchk-1.2.2.20020717/src/tests/elfchk/mkdtneededlist
lsblibchk-1.2.2.20020717/src/tests/elfchk/mkdyntags
lsblibchk-1.2.2.20020717/src/tests/elfchk/mkfunclist
lsblibchk-1.2.2.20020717/src/tests/elfchk/mkfunclist2
lsblibchk-1.2.2.20020717/src/tests/elfchk/mksectinfo
lsblibchk-1.2.2.20020717/src/tests/elfchk/proghdr.c
lsblibchk-1.2.2.20020717/src/tests/elfchk/proghdr.h
lsblibchk-1.2.2.20020717/src/tests/elfchk/proginterp.c
lsblibchk-1.2.2.20020717/src/tests/elfchk/sectinfo.c
lsblibchk-1.2.2.20020717/src/tests/elfchk/sections.c
lsblibchk-1.2.2.20020717/src/tests/elfchk/sections.h
lsblibchk-1.2.2.20020717/src/tests/elfchk/symvers.c
lsblibchk-1.2.2.20020717/src/tests/elfchk/symvers.h
lsblibchk-1.2.2.20020717/src/tests/elfchk/test.c
lsblibchk-1.2.2.20020717/src/tests/elfchk/util.c
lsblibchk-1.2.2.20020717/src/tests/libchk/
lsblibchk-1.2.2.20020717/src/tests/libchk/.cvsignore
lsblibchk-1.2.2.20020717/src/tests/libchk/Artistic
lsblibchk-1.2.2.20020717/src/tests/libchk/License.libchk
lsblibchk-1.2.2.20020717/src/tests/libchk/README
lsblibchk-1.2.2.20020717/src/tests/libchk/ld_lsb_ia64_so_1.c
lsblibchk-1.2.2.20020717/src/tests/libchk/ld_lsb_so_1.c
lsblibchk-1.2.2.20020717/src/tests/libchk/libGL_so_1.c
lsblibchk-1.2.2.20020717/src/tests/libchk/libICE_so_6.c
lsblibchk-1.2.2.20020717/src/tests/libchk/libSM_so_6.c
lsblibchk-1.2.2.20020717/src/tests/libchk/libX11_so_6.c
lsblibchk-1.2.2.20020717/src/tests/libchk/libXext_so_6.c
lsblibchk-1.2.2.20020717/src/tests/libchk/libXt_so_6.c
lsblibchk-1.2.2.20020717/src/tests/libchk/libc_so_6.c
lsblibchk-1.2.2.20020717/src/tests/libchk/libc_so_6_1.c
lsblibchk-1.2.2.20020717/src/tests/libchk/libchk.c
lsblibchk-1.2.2.20020717/src/tests/libchk/libcrypt_so_1.c
lsblibchk-1.2.2.20020717/src/tests/libchk/libdb_so_3.c
lsblibchk-1.2.2.20020717/src/tests/libchk/libdl_so_2.c
lsblibchk-1.2.2.20020717/src/tests/libchk/libm_so_6.c
lsblibchk-1.2.2.20020717/src/tests/libchk/libm_so_6_1.c
lsblibchk-1.2.2.20020717/src/tests/libchk/libncurses_so_5.c
lsblibchk-1.2.2.20020717/src/tests/libchk/libpthread_so_0.c
lsblibchk-1.2.2.20020717/src/tests/libchk/librt_so_1.c
lsblibchk-1.2.2.20020717/src/tests/libchk/libs.c
lsblibchk-1.2.2.20020717/src/tests/libchk/libs.h
lsblibchk-1.2.2.20020717/src/tests/libchk/libs.mk
lsblibchk-1.2.2.20020717/src/tests/libchk/libutil_so_1.c
lsblibchk-1.2.2.20020717/src/tests/libchk/libz_so_1.c
lsblibchk-1.2.2.20020717/src/tests/libchk/lsblibchk.1
lsblibchk-1.2.2.20020717/src/tests/libchk/machine_info
lsblibchk-1.2.2.20020717/src/tests/libchk/makefile
lsblibchk-1.2.2.20020717/src/tests/libchk/mkfunclist
lsblibchk-1.2.2.20020717/src/tests/libchk/run_tests
lsblibchk-1.2.2.20020717/src/tests/tetj/
lsblibchk-1.2.2.20020717/src/tests/tetj/Makefile
lsblibchk-1.2.2.20020717/src/tests/tetj/tetj.c
lsblibchk-1.2.2.20020717/src/tests/tetj/tetj.h
lsblibchk-1.2.2.20020717/README
lsblibchk-1.2.2.20020717/Licence
lsblibchk-1.2.2.20020717/Artistic
lsblibchk-1.2.2.20020717/Makefile
Executing(%prep): /bin/sh -e /var/tmp/rpm-tmp.31168
+ umask 022
+ cd /var/tmp/rpm-build/BUILD
+ cd /var/tmp/rpm-build/BUILD
+ rm -rf lsblibchk-1.2.2.20020717
+ /bin/gzip -dc /tmp/lsb_autobuild.14486/src/pkgs/lsblibchk/lsblibchk-1.2.2.20020717.tar.gz
+ tar -xf -
+ STATUS=0
+ '[' 0 -ne 0 ']'
+ cd lsblibchk-1.2.2.20020717
+ exit 0
Executing(%build): /bin/sh -e /var/tmp/rpm-tmp.31168
+ umask 022
+ cd /var/tmp/rpm-build/BUILD
+ cd lsblibchk-1.2.2.20020717
+ make LSBVERSION=1.2.2.20020717 LSBLIBCHK_VERSION=1.2.2.20020717-1
make[1]: Entering directory `/var/tmp/rpm-build/BUILD/lsblibchk-1.2.2.20020717'
cd src/tests/tetj && make
make[2]: Entering directory `/var/tmp/rpm-build/BUILD/lsblibchk-1.2.2.20020717/src/tests/tetj'
cc -g -Wall   -c -o tetj.o tetj.c
rm -f libtetj.a;ar clq libtetj.a tetj.o
make[2]: Leaving directory `/var/tmp/rpm-build/BUILD/lsblibchk-1.2.2.20020717/src/tests/tetj'
cd src/tests/elfchk && make
make[2]: Entering directory `/var/tmp/rpm-build/BUILD/lsblibchk-1.2.2.20020717/src/tests/elfchk'
cc -g -Wall   -c -o dynsyms.o dynsyms.c
cc -g -Wall   -c -o dynamic.o dynamic.c
cc -g -Wall   -c -o dyntags.o dyntags.c
cc -g -Wall   -c -o dtneeded.o dtneeded.c
cc -g -Wall   -c -o elfchk.o elfchk.c
cc -g -Wall   -c -o hdr.o hdr.c
cc -g -Wall   -c -o proghdr.o proghdr.c
cc -g -Wall   -c -o sectinfo.o sectinfo.c
cc -g -Wall   -c -o sections.o sections.c
cc -g -Wall   -c -o symvers.o symvers.c
cc -g -Wall   -c -o util.o util.c
cc -g -Wall   -c -o proginterp.o proginterp.c
rm -f libelfchk.a;ar clq libelfchk.a dynsyms.o dynamic.o dyntags.o dtneeded.o elfchk.o hdr.o proghdr.o sectinfo.o sections.o symvers.o util.o proginterp.o
cc -o test -g -Wall test.c libelfchk.a ../tetj/libtetj.a
make[2]: Leaving directory `/var/tmp/rpm-build/BUILD/lsblibchk-1.2.2.20020717/src/tests/elfchk'
cd src/tests/libchk && make
make[2]: Entering directory `/var/tmp/rpm-build/BUILD/lsblibchk-1.2.2.20020717/src/tests/libchk'
cc -g -I../elfchk -DLSBVERSION=\"$LSBVERSION\" -DLSBLIBCHK_VERSION=\"1.2.2.20020717-1\" -Wall   -c -o libchk.o libchk.c
cc -g -I../elfchk -DLSBVERSION=\"$LSBVERSION\" -DLSBLIBCHK_VERSION=\"1.2.2.20020717-1\" -Wall   -c -o libs.o libs.c
cc -g -I../elfchk -DLSBVERSION=\"$LSBVERSION\" -DLSBLIBCHK_VERSION=\"1.2.2.20020717-1\" -Wall   -c -o ld_lsb_ia64_so_1.o ld_lsb_ia64_so_1.c
cc -g -I../elfchk -DLSBVERSION=\"$LSBVERSION\" -DLSBLIBCHK_VERSION=\"1.2.2.20020717-1\" -Wall   -c -o ld_lsb_so_1.o ld_lsb_so_1.c
cc -g -I../elfchk -DLSBVERSION=\"$LSBVERSION\" -DLSBLIBCHK_VERSION=\"1.2.2.20020717-1\" -Wall   -c -o libc_so_6.o libc_so_6.c
cc -g -I../elfchk -DLSBVERSION=\"$LSBVERSION\" -DLSBLIBCHK_VERSION=\"1.2.2.20020717-1\" -Wall   -c -o libc_so_6_1.o libc_so_6_1.c
cc -g -I../elfchk -DLSBVERSION=\"$LSBVERSION\" -DLSBLIBCHK_VERSION=\"1.2.2.20020717-1\" -Wall   -c -o libcrypt_so_1.o libcrypt_so_1.c
cc -g -I../elfchk -DLSBVERSION=\"$LSBVERSION\" -DLSBLIBCHK_VERSION=\"1.2.2.20020717-1\" -Wall   -c -o libdl_so_2.o libdl_so_2.c
cc -g -I../elfchk -DLSBVERSION=\"$LSBVERSION\" -DLSBLIBCHK_VERSION=\"1.2.2.20020717-1\" -Wall   -c -o libGL_so_1.o libGL_so_1.c
cc -g -I../elfchk -DLSBVERSION=\"$LSBVERSION\" -DLSBLIBCHK_VERSION=\"1.2.2.20020717-1\" -Wall   -c -o libICE_so_6.o libICE_so_6.c
cc -g -I../elfchk -DLSBVERSION=\"$LSBVERSION\" -DLSBLIBCHK_VERSION=\"1.2.2.20020717-1\" -Wall   -c -o libm_so_6.o libm_so_6.c
cc -g -I../elfchk -DLSBVERSION=\"$LSBVERSION\" -DLSBLIBCHK_VERSION=\"1.2.2.20020717-1\" -Wall   -c -o libm_so_6_1.o libm_so_6_1.c
cc -g -I../elfchk -DLSBVERSION=\"$LSBVERSION\" -DLSBLIBCHK_VERSION=\"1.2.2.20020717-1\" -Wall   -c -o libncurses_so_5.o libncurses_so_5.c
cc -g -I../elfchk -DLSBVERSION=\"$LSBVERSION\" -DLSBLIBCHK_VERSION=\"1.2.2.20020717-1\" -Wall   -c -o libpthread_so_0.o libpthread_so_0.c
cc -g -I../elfchk -DLSBVERSION=\"$LSBVERSION\" -DLSBLIBCHK_VERSION=\"1.2.2.20020717-1\" -Wall   -c -o libSM_so_6.o libSM_so_6.c
cc -g -I../elfchk -DLSBVERSION=\"$LSBVERSION\" -DLSBLIBCHK_VERSION=\"1.2.2.20020717-1\" -Wall   -c -o libutil_so_1.o libutil_so_1.c
cc -g -I../elfchk -DLSBVERSION=\"$LSBVERSION\" -DLSBLIBCHK_VERSION=\"1.2.2.20020717-1\" -Wall   -c -o libX11_so_6.o libX11_so_6.c
cc -g -I../elfchk -DLSBVERSION=\"$LSBVERSION\" -DLSBLIBCHK_VERSION=\"1.2.2.20020717-1\" -Wall   -c -o libXext_so_6.o libXext_so_6.c
cc -g -I../elfchk -DLSBVERSION=\"$LSBVERSION\" -DLSBLIBCHK_VERSION=\"1.2.2.20020717-1\" -Wall   -c -o libXt_so_6.o libXt_so_6.c
cc -g -I../elfchk -DLSBVERSION=\"$LSBVERSION\" -DLSBLIBCHK_VERSION=\"1.2.2.20020717-1\" -Wall   -c -o libz_so_1.o libz_so_1.c
cc -g -I../elfchk -DLSBVERSION=\"$LSBVERSION\" -DLSBLIBCHK_VERSION=\"1.2.2.20020717-1\" -Wall -o libchk libchk.o libs.o ld_lsb_ia64_so_1.o ld_lsb_so_1.o libc_so_6.o libc_so_6_1.o libcrypt_so_1.o libdl_so_2.o libGL_so_1.o libICE_so_6.o libm_so_6.o libm_so_6_1.o libncurses_so_5.o libpthread_so_0.o libSM_so_6.o libutil_so_1.o libX11_so_6.o libXext_so_6.o libXt_so_6.o libz_so_1.o  -L../elfchk -L ../tetj -lelfchk -ltetj
make[2]: Leaving directory `/var/tmp/rpm-build/BUILD/lsblibchk-1.2.2.20020717/src/tests/libchk'
make[1]: Leaving directory `/var/tmp/rpm-build/BUILD/lsblibchk-1.2.2.20020717'
+ exit 0
Executing(%install): /bin/sh -e /var/tmp/rpm-tmp.78381
+ umask 022
+ cd /var/tmp/rpm-build/BUILD
+ cd lsblibchk-1.2.2.20020717
+ rm -rf /var/tmp/lsblibchk-root
+ make install INSTALL_ROOT=/var/tmp/lsblibchk-root/opt/lsblibchk
make[1]: Entering directory `/var/tmp/rpm-build/BUILD/lsblibchk-1.2.2.20020717'
cd src/tests/libchk && make install
make[2]: Entering directory `/var/tmp/rpm-build/BUILD/lsblibchk-1.2.2.20020717/src/tests/libchk'
install -d /var/tmp/lsblibchk-root/opt/lsblibchk//bin
install libchk /var/tmp/lsblibchk-root/opt/lsblibchk//bin/lsblibchk
install lsblibchk.1 /var/tmp/lsblibchk-root/opt/lsblibchk//man/man1/lsblibchk.1
install: cannot create regular file `/var/tmp/lsblibchk-root/opt/lsblibchk//man/man1/lsblibchk.1': No such file or directory
make[2]: *** [install] Error 1
make[2]: Leaving directory `/var/tmp/rpm-build/BUILD/lsblibchk-1.2.2.20020717/src/tests/libchk'
make[1]: *** [install] Error 2
make[1]: Leaving directory `/var/tmp/rpm-build/BUILD/lsblibchk-1.2.2.20020717'
error: Bad exit status from /var/tmp/rpm-tmp.78381 (%install)


RPM build errors:
    Bad exit status from /var/tmp/rpm-tmp.78381 (%install)
make: *** [lsblibchk-1.2.2.20020717-1.ppc.rpm] Error 1




More information about the lsb-autobuild mailing list