[Lsb-autobuild] Build failure for lsbpkgchk on s390

lsb-autobuild at freestandards.org lsb-autobuild at freestandards.org
Tue Jul 27 20:08:22 PDT 2004


This is an automated message generated when a build failure occurs

Linux aushat70 2.4.19-4suse-SMP #1 SMP Thu Jun 5 23:01:37 UTC 2003 s390 unknown
Failed to make packages for lsbpkgchk
if test ! -e .need_config_update || test 2.0.0.20040727-1 != `cat .need_config_update`; \
  then echo 2.0.0.20040727-1 > .need_config_update; \
fi
sed -e "s#@LSBVERSION@#`echo 2.0.0.20040727`#" -e "s#@PACKAGE_RELEASE@#`echo 1`#" < lsb-pkgchk.spec.sed > lsb-pkgchk.spec
if [ -e /tmp/lsb-pkgchk-2.0.0.20040727 ]; then rm -rf /tmp/lsb-pkgchk-2.0.0.20040727; fi
mkdir -p /tmp/lsb-pkgchk-2.0.0.20040727
OK=0 && while test $OK -ne 1; do cd /tmp/lsb-pkgchk-2.0.0.20040727 && cvs -z9 export -D now tests/misc/tetj && OK=1; done
cvs export: Updating tests/misc/tetj
U tests/misc/tetj/Makefile
U tests/misc/tetj/README
U tests/misc/tetj/tetj.c
U tests/misc/tetj/tetj.h
U tests/misc/tetj/tetj.py
OK=0 && while test $OK -ne 1; do cd /tmp/lsb-pkgchk-2.0.0.20040727 && cvs -z9 export -D now tests/misc/fhschk && OK=1; done
cvs export: Updating tests/misc/fhschk
U tests/misc/fhschk/fhschk.h
U tests/misc/fhschk/fhspaths.c
U tests/misc/fhschk/makefile
U tests/misc/fhschk/mkabs.c
OK=0 && while test $OK -ne 1; do cd /tmp/lsb-pkgchk-2.0.0.20040727 && cvs -z9 export -D now tests/misc/pkgchk && OK=1; done
cvs export: Updating tests/misc/pkgchk
U tests/misc/pkgchk/.cvsignore
U tests/misc/pkgchk/lsbpkgchk.1
U tests/misc/pkgchk/makefile
U tests/misc/pkgchk/pkgchk.c
OK=0 && while test $OK -ne 1; do cd /tmp/lsb-pkgchk-2.0.0.20040727 && cvs -z9 export -D now tests/misc/rpmchk && OK=1; done
cvs export: Updating tests/misc/rpmchk
U tests/misc/rpmchk/.cvsignore
U tests/misc/rpmchk/archive.c
U tests/misc/rpmchk/check.c
U tests/misc/rpmchk/fhs.c
U tests/misc/rpmchk/hdr.c
U tests/misc/rpmchk/idxtag.c
U tests/misc/rpmchk/idxtbl.c
U tests/misc/rpmchk/lead.c
U tests/misc/rpmchk/makefile
U tests/misc/rpmchk/md5.h
U tests/misc/rpmchk/md5c.c
U tests/misc/rpmchk/mktaghdr
U tests/misc/rpmchk/mktagtbl
U tests/misc/rpmchk/rpmchk.c
U tests/misc/rpmchk/rpmchk.h
U tests/misc/rpmchk/rpmtag.h
U tests/misc/rpmchk/tagfuncs.h
U tests/misc/rpmchk/test.c
U tests/misc/rpmchk/util.c
U tests/misc/rpmchk/vals.c
cp -pr README Licence /tmp/lsb-pkgchk-2.0.0.20040727
cp -p Makefile.build /tmp/lsb-pkgchk-2.0.0.20040727/Makefile
cd /tmp/lsb-pkgchk-2.0.0.20040727/.. && tar cvfz /tmp/lsb_autobuild.30976/packaging/lsbpkgchk/lsb-pkgchk-2.0.0.20040727.tar.gz lsb-pkgchk-2.0.0.20040727 && rm -rf /tmp/lsb-pkgchk-2.0.0.20040727
lsb-pkgchk-2.0.0.20040727/
lsb-pkgchk-2.0.0.20040727/Makefile
lsb-pkgchk-2.0.0.20040727/tests/
lsb-pkgchk-2.0.0.20040727/tests/misc/
lsb-pkgchk-2.0.0.20040727/tests/misc/tetj/
lsb-pkgchk-2.0.0.20040727/tests/misc/tetj/Makefile
lsb-pkgchk-2.0.0.20040727/tests/misc/tetj/README
lsb-pkgchk-2.0.0.20040727/tests/misc/tetj/tetj.py
lsb-pkgchk-2.0.0.20040727/tests/misc/tetj/tetj.c
lsb-pkgchk-2.0.0.20040727/tests/misc/tetj/tetj.h
lsb-pkgchk-2.0.0.20040727/tests/misc/fhschk/
lsb-pkgchk-2.0.0.20040727/tests/misc/fhschk/fhschk.h
lsb-pkgchk-2.0.0.20040727/tests/misc/fhschk/makefile
lsb-pkgchk-2.0.0.20040727/tests/misc/fhschk/mkabs.c
lsb-pkgchk-2.0.0.20040727/tests/misc/fhschk/fhspaths.c
lsb-pkgchk-2.0.0.20040727/tests/misc/pkgchk/
lsb-pkgchk-2.0.0.20040727/tests/misc/pkgchk/makefile
lsb-pkgchk-2.0.0.20040727/tests/misc/pkgchk/pkgchk.c
lsb-pkgchk-2.0.0.20040727/tests/misc/pkgchk/.cvsignore
lsb-pkgchk-2.0.0.20040727/tests/misc/pkgchk/lsbpkgchk.1
lsb-pkgchk-2.0.0.20040727/tests/misc/rpmchk/
lsb-pkgchk-2.0.0.20040727/tests/misc/rpmchk/fhs.c
lsb-pkgchk-2.0.0.20040727/tests/misc/rpmchk/hdr.c
lsb-pkgchk-2.0.0.20040727/tests/misc/rpmchk/md5.h
lsb-pkgchk-2.0.0.20040727/tests/misc/rpmchk/makefile
lsb-pkgchk-2.0.0.20040727/tests/misc/rpmchk/archive.c
lsb-pkgchk-2.0.0.20040727/tests/misc/rpmchk/lead.c
lsb-pkgchk-2.0.0.20040727/tests/misc/rpmchk/md5c.c
lsb-pkgchk-2.0.0.20040727/tests/misc/rpmchk/idxtag.c
lsb-pkgchk-2.0.0.20040727/tests/misc/rpmchk/idxtbl.c
lsb-pkgchk-2.0.0.20040727/tests/misc/rpmchk/rpmchk.c
lsb-pkgchk-2.0.0.20040727/tests/misc/rpmchk/rpmchk.h
lsb-pkgchk-2.0.0.20040727/tests/misc/rpmchk/test.c
lsb-pkgchk-2.0.0.20040727/tests/misc/rpmchk/rpmtag.h
lsb-pkgchk-2.0.0.20040727/tests/misc/rpmchk/vals.c
lsb-pkgchk-2.0.0.20040727/tests/misc/rpmchk/util.c
lsb-pkgchk-2.0.0.20040727/tests/misc/rpmchk/tagfuncs.h
lsb-pkgchk-2.0.0.20040727/tests/misc/rpmchk/.cvsignore
lsb-pkgchk-2.0.0.20040727/tests/misc/rpmchk/mktaghdr
lsb-pkgchk-2.0.0.20040727/tests/misc/rpmchk/mktagtbl
lsb-pkgchk-2.0.0.20040727/tests/misc/rpmchk/check.c
lsb-pkgchk-2.0.0.20040727/README
lsb-pkgchk-2.0.0.20040727/Licence
Executing(%prep): /bin/sh -e /var/tmp/rpm-tmp.19894
+ umask 022
+ cd /var/tmp/rpm-build/BUILD
+ cd /var/tmp/rpm-build/BUILD
+ rm -rf lsb-pkgchk-2.0.0.20040727
+ /bin/gzip -dc /tmp/lsb_autobuild.30976/packaging/lsbpkgchk/lsb-pkgchk-2.0.0.20040727.tar.gz
+ tar -xf -
+ STATUS=0
+ '[' 0 -ne 0 ']'
+ cd lsb-pkgchk-2.0.0.20040727
++ /usr/bin/id -u
+ '[' 502 = 0 ']'
++ /usr/bin/id -u
+ '[' 502 = 0 ']'
+ /bin/chmod -Rf a+rX,g-w,o-w .
+ exit 0
Executing(%build): /bin/sh -e /var/tmp/rpm-tmp.5477
+ umask 022
+ cd /var/tmp/rpm-build/BUILD
+ cd lsb-pkgchk-2.0.0.20040727
+ make LSBVERSION=2.0.0.20040727 LSBPKGCHK_VERSION=2.0.0.20040727-1
make[1]: Entering directory `/var/tmp/rpm-build/BUILD/lsb-pkgchk-2.0.0.20040727'
cd tests/misc/tetj && make 
make[2]: Entering directory `/var/tmp/rpm-build/BUILD/lsb-pkgchk-2.0.0.20040727/tests/misc/tetj'
cc -g -Wall   -c -o tetj.o tetj.c
rm -f libtetj.a;ar clq libtetj.a tetj.o
make[2]: Leaving directory `/var/tmp/rpm-build/BUILD/lsb-pkgchk-2.0.0.20040727/tests/misc/tetj'
cd tests/misc/fhschk && make 
make[2]: Entering directory `/var/tmp/rpm-build/BUILD/lsb-pkgchk-2.0.0.20040727/tests/misc/fhschk'
cc    -c -o fhspaths.o fhspaths.c
cc    -c -o mkabs.o mkabs.c
rm -f libfhschk.a;ar clq libfhschk.a fhspaths.o mkabs.o
make[2]: Leaving directory `/var/tmp/rpm-build/BUILD/lsb-pkgchk-2.0.0.20040727/tests/misc/fhschk'
cd tests/misc/rpmchk && make 
make[2]: Entering directory `/var/tmp/rpm-build/BUILD/lsb-pkgchk-2.0.0.20040727/tests/misc/rpmchk'
cc -g -Wall   -c -o archive.o archive.c
cc -g -Wall   -c -o hdr.o hdr.c
cc -g -Wall   -c -o idxtag.o idxtag.c
idxtag.c: In function `checkRpmIdxNAME':
idxtag.c:451: warning: implicit declaration of function `set_myappname'
idxtag.c: In function `checkRpmIdxREQUIRENAME':
idxtag.c:1514: parse error at end of input
make[2]: *** [idxtag.o] Error 1
make[2]: Leaving directory `/var/tmp/rpm-build/BUILD/lsb-pkgchk-2.0.0.20040727/tests/misc/rpmchk'
make[1]: *** [all] Error 2
make[1]: Leaving directory `/var/tmp/rpm-build/BUILD/lsb-pkgchk-2.0.0.20040727'
Bad exit status from /var/tmp/rpm-tmp.5477 (%build)
make: *** [lsb-pkgchk-2.0.0.20040727-1.s390.rpm] Error 1




More information about the lsb-autobuild mailing list