[Lsb-autobuild] Build failure for lsbcmdchk on s390

lsb-autobuild at freestandards.org lsb-autobuild at freestandards.org
Sat Apr 1 01:04:01 PST 2006


This is an automated message generated when a build failure occurs

Linux aushat228.austin.ibm.com 2.6.9-34.EL #1 SMP Fri Feb 24 16:45:20 EST 2006 s390 s390 s390 GNU/Linux
Failed to make packages for lsbcmdchk
if test ! -e .need_config_update || test 3.0.6.20060401-1 != `cat .need_config_update`; \
  then echo 3.0.6.20060401-1 > .need_config_update; \
fi
sed -e "s#@LSBVERSION@#`echo 3.0.6.20060401`#" -e "s#@PACKAGE_RELEASE@#`echo 1`#" < lsb-cmdchk.spec.sed > lsb-cmdchk.spec
if [ -e /home/autobuild/tmp/lsb-cmdchk-3.0.6.20060401 ]; then rm -rf /home/autobuild/tmp/lsb-cmdchk-3.0.6.20060401; fi
mkdir -p /home/autobuild/tmp/lsb-cmdchk-3.0.6.20060401
OK=0 && while test $OK -ne 1; do cd /home/autobuild/tmp/lsb-cmdchk-3.0.6.20060401 && cvs -z9 export -D now tests/misc/cmdchk && OK=1; done
cvs export: Updating tests/misc/cmdchk
U tests/misc/cmdchk/.cvsignore
U tests/misc/cmdchk/Artistic
U tests/misc/cmdchk/License.cmdchk
U tests/misc/cmdchk/README
U tests/misc/cmdchk/cmdchk.c
U tests/misc/cmdchk/cmdchk.py
U tests/misc/cmdchk/cmdlist
U tests/misc/cmdchk/cmds.h
U tests/misc/cmdchk/lsbcmdchk.1
U tests/misc/cmdchk/makefile
U tests/misc/cmdchk/mkcmdlist
U tests/misc/cmdchk/mkcmdlist2
OK=0 && while test $OK -ne 1; do cd /home/autobuild/tmp/lsb-cmdchk-3.0.6.20060401 && cvs -z9 export -D now tests/misc/tetj && OK=1; done
cvs export: Updating tests/misc/tetj
U tests/misc/tetj/Makefile
U tests/misc/tetj/README
U tests/misc/tetj/tetj.3
U tests/misc/tetj/tetj.c
U tests/misc/tetj/tetj.h
U tests/misc/tetj/tetj.py
U tests/misc/tetj/tetjtest.c
cp -pr README Licence Artistic /home/autobuild/tmp/lsb-cmdchk-3.0.6.20060401
cp -p Makefile.build /home/autobuild/tmp/lsb-cmdchk-3.0.6.20060401/Makefile
cd /home/autobuild/tmp/lsb-cmdchk-3.0.6.20060401/.. && tar cvfz /tmp/lsb_autobuild.480/packaging/lsbcmdchk/lsb-cmdchk-3.0.6.20060401.tar.gz lsb-cmdchk-3.0.6.20060401 && rm -rf /home/autobuild/tmp/lsb-cmdchk-3.0.6.20060401
lsb-cmdchk-3.0.6.20060401/
lsb-cmdchk-3.0.6.20060401/Licence
lsb-cmdchk-3.0.6.20060401/Artistic
lsb-cmdchk-3.0.6.20060401/README
lsb-cmdchk-3.0.6.20060401/Makefile
lsb-cmdchk-3.0.6.20060401/tests/
lsb-cmdchk-3.0.6.20060401/tests/misc/
lsb-cmdchk-3.0.6.20060401/tests/misc/cmdchk/
lsb-cmdchk-3.0.6.20060401/tests/misc/cmdchk/mkcmdlist
lsb-cmdchk-3.0.6.20060401/tests/misc/cmdchk/cmdchk.c
lsb-cmdchk-3.0.6.20060401/tests/misc/cmdchk/cmdchk.py
lsb-cmdchk-3.0.6.20060401/tests/misc/cmdchk/Artistic
lsb-cmdchk-3.0.6.20060401/tests/misc/cmdchk/README
lsb-cmdchk-3.0.6.20060401/tests/misc/cmdchk/License.cmdchk
lsb-cmdchk-3.0.6.20060401/tests/misc/cmdchk/lsbcmdchk.1
lsb-cmdchk-3.0.6.20060401/tests/misc/cmdchk/.cvsignore
lsb-cmdchk-3.0.6.20060401/tests/misc/cmdchk/cmds.h
lsb-cmdchk-3.0.6.20060401/tests/misc/cmdchk/makefile
lsb-cmdchk-3.0.6.20060401/tests/misc/cmdchk/mkcmdlist2
lsb-cmdchk-3.0.6.20060401/tests/misc/cmdchk/cmdlist
lsb-cmdchk-3.0.6.20060401/tests/misc/tetj/
lsb-cmdchk-3.0.6.20060401/tests/misc/tetj/tetj.py
lsb-cmdchk-3.0.6.20060401/tests/misc/tetj/tetj.c
lsb-cmdchk-3.0.6.20060401/tests/misc/tetj/README
lsb-cmdchk-3.0.6.20060401/tests/misc/tetj/Makefile
lsb-cmdchk-3.0.6.20060401/tests/misc/tetj/tetj.3
lsb-cmdchk-3.0.6.20060401/tests/misc/tetj/tetj.h
lsb-cmdchk-3.0.6.20060401/tests/misc/tetj/tetjtest.c
spawn rpmbuild --sign --rcfile /usr/lib/rpm/rpmrc:../rpmrc:~/.rpmrc --define=_sourcedir /tmp/lsb_autobuild.480/packaging/lsbcmdchk --define=buildroot /home/autobuild/tmp/lsb-cmdchk-3.0.6.20060401 --define=_topdir /home/autobuild/tmp/rpm-build --define=_target_cpu s390 -bb lsb-cmdchk.spec
Enter pass phrase: 
Pass phrase is good.
Executing(%prep): /bin/sh -e /var/tmp/rpm-tmp.36242
+ umask 022
+ cd /home/autobuild/tmp/rpm-build/BUILD
+ cd /home/autobuild/tmp/rpm-build/BUILD
+ rm -rf lsb-cmdchk-3.0.6.20060401
+ /bin/gzip -dc /tmp/lsb_autobuild.480/packaging/lsbcmdchk/lsb-cmdchk-3.0.6.20060401.tar.gz
+ tar -xf -
+ STATUS=0
+ '[' 0 -ne 0 ']'
+ cd lsb-cmdchk-3.0.6.20060401
+ exit 0
Executing(%build): /bin/sh -e /var/tmp/rpm-tmp.36242
+ umask 022
+ cd /home/autobuild/tmp/rpm-build/BUILD
+ cd lsb-cmdchk-3.0.6.20060401
+ CC=/opt/lsb/bin/lsbcc
+ make LSBVERSION=3.0.6.20060401 LSBCMDCHK_VERSION=3.0.6.20060401-1
make[1]: Entering directory `/home/autobuild/tmp/rpm-build/BUILD/lsb-cmdchk-3.0.6.20060401'
cd tests/misc/tetj && make
make[2]: Entering directory `/home/autobuild/tmp/rpm-build/BUILD/lsb-cmdchk-3.0.6.20060401/tests/misc/tetj'
/opt/lsb/bin/lsbcc -g -Wall   -c -o tetj.o tetj.c
make[2]: /opt/lsb/bin/lsbcc: Command not found
make[2]: *** [tetj.o] Error 127
make[2]: Leaving directory `/home/autobuild/tmp/rpm-build/BUILD/lsb-cmdchk-3.0.6.20060401/tests/misc/tetj'
make[1]: *** [all] Error 2
make[1]: Leaving directory `/home/autobuild/tmp/rpm-build/BUILD/lsb-cmdchk-3.0.6.20060401'
error: Bad exit status from /var/tmp/rpm-tmp.36242 (%build)


RPM build errors:
    Bad exit status from /var/tmp/rpm-tmp.36242 (%build)
expect: spawn id exp3 not open
    while executing
"expect "exit 0""
send: spawn id exp3 not open
    while executing
"send "\n""
mv: cannot stat `/home/autobuild/tmp/rpm-build/RPMS/s390/lsb-cmdchk-3.0.6.20060401-1.s390.rpm': No such file or directory
make: *** [lsb-cmdchk-3.0.6.20060401-1.s390.rpm] Error 1



More information about the lsb-autobuild mailing list