[Lsb-autobuild] Build failure for lsblibchk on ppc

lsb-autobuild at freestandards.org lsb-autobuild at freestandards.org
Mon Apr 3 01:04:48 PDT 2006


This is an automated message generated when a build failure occurs

Linux lsbppc32b 2.6.9-34.EL #1 SMP Fri Feb 24 16:46:57 EST 2006 ppc ppc ppc GNU/Linux
Failed to make packages for lsblibchk
if test ! -e .need_config_update || test 3.0.6.20060403-1 != `cat .need_config_update`; \
  then echo 3.0.6.20060403-1 > .need_config_update; \
fi
sed -e "s#@LSBVERSION@#`echo 3.0.6.20060403`#" -e "s#@PACKAGE_RELEASE@#`echo 1`#" < lsb-libchk.spec.sed > lsb-libchk.spec
if [ -e /home/autobuild/tmp/lsb-libchk-3.0.6.20060403 ]; then rm -rf /home/autobuild/tmp/lsb-libchk-3.0.6.20060403; fi
mkdir -p /home/autobuild/tmp/lsb-libchk-3.0.6.20060403
OK=0 && while test $OK -ne 1; do cd /home/autobuild/tmp/lsb-libchk-3.0.6.20060403 && cvs -z9 export -D now tests/misc/elfchk && OK=1; done
cvs export: Updating tests/misc/elfchk
U tests/misc/elfchk/.cvsignore
U tests/misc/elfchk/dtneeded.c
U tests/misc/elfchk/dump_modules
U tests/misc/elfchk/dumpbytes.c
U tests/misc/elfchk/dwarf.c
U tests/misc/elfchk/dwarf.h
U tests/misc/elfchk/dwarf2.h
U tests/misc/elfchk/dynamic.c
U tests/misc/elfchk/dynamic.h
U tests/misc/elfchk/dynsyms.c
U tests/misc/elfchk/dyntags.c
U tests/misc/elfchk/elfchk.c
U tests/misc/elfchk/elfchk.h
U tests/misc/elfchk/genit
U tests/misc/elfchk/hdr.c
U tests/misc/elfchk/hdr.h
U tests/misc/elfchk/makefile
U tests/misc/elfchk/mkdtneededlist
U tests/misc/elfchk/mkdyntags
U tests/misc/elfchk/mkfunclist
U tests/misc/elfchk/mkfunclist2
U tests/misc/elfchk/mksectinfo
U tests/misc/elfchk/mksecttype
U tests/misc/elfchk/modules.c
U tests/misc/elfchk/modules.h
U tests/misc/elfchk/note.c
U tests/misc/elfchk/progbits.c
U tests/misc/elfchk/progbits.h
U tests/misc/elfchk/proghdr.c
U tests/misc/elfchk/proghdr.h
U tests/misc/elfchk/proginterp.c
U tests/misc/elfchk/sectinfo.c
U tests/misc/elfchk/sections.c
U tests/misc/elfchk/sections.h
U tests/misc/elfchk/secttype.c
U tests/misc/elfchk/symvers.c
U tests/misc/elfchk/symvers.h
U tests/misc/elfchk/test.c
U tests/misc/elfchk/util.c
OK=0 && while test $OK -ne 1; do cd /home/autobuild/tmp/lsb-libchk-3.0.6.20060403 && cvs -z9 export -D now tests/misc/libchk && OK=1; done
cvs export: Updating tests/misc/libchk
U tests/misc/libchk/.cvsignore
U tests/misc/libchk/Artistic
U tests/misc/libchk/License.libchk
U tests/misc/libchk/README
U tests/misc/libchk/classchk.c
U tests/misc/libchk/dummy_link.c
U tests/misc/libchk/dumpints.c
U tests/misc/libchk/ld_lsb_ia64_so_3.c
U tests/misc/libchk/ld_lsb_ppc32_so_3.c
U tests/misc/libchk/ld_lsb_ppc64_so_3.c
U tests/misc/libchk/ld_lsb_s390_so_3.c
U tests/misc/libchk/ld_lsb_s390x_so_3.c
U tests/misc/libchk/ld_lsb_so_3.c
U tests/misc/libchk/ld_lsb_x86_64_so_3.c
U tests/misc/libchk/libGL_so_1.c
U tests/misc/libchk/libICE_so_6.c
U tests/misc/libchk/libQtCore_so_4.c
U tests/misc/libchk/libQtGui_so_4.c
U tests/misc/libchk/libQtNetwork_so_4.c
U tests/misc/libchk/libQtOpenGL_so_4.c
U tests/misc/libchk/libQtSql_so_4.c
U tests/misc/libchk/libQtSvg_so_4.c
U tests/misc/libchk/libQtXml_so_4.c
U tests/misc/libchk/libSM_so_6.c
U tests/misc/libchk/libX11_so_6.c
U tests/misc/libchk/libXext_so_6.c
U tests/misc/libchk/libXi_so_6.c
U tests/misc/libchk/libXt_so_6.c
U tests/misc/libchk/libatk_1_0_so_0.c
U tests/misc/libchk/libc_so_6.c
U tests/misc/libchk/libc_so_6_1.c
U tests/misc/libchk/libchk.c
U tests/misc/libchk/libchk.h
U tests/misc/libchk/libcrypt_so_1.c
U tests/misc/libchk/libdb_so_3.c
U tests/misc/libchk/libdl_so_2.c
U tests/misc/libchk/libfontconfig_so_1.c
U tests/misc/libchk/libgcc_s_so_1.c
U tests/misc/libchk/libgdk_pixbuf_2_0_so_0.c
U tests/misc/libchk/libgdk_pixbuf_xlib_2_0_so.c
U tests/misc/libchk/libgdk_pixbuf_xlib_2_0_so_0.c
U tests/misc/libchk/libgdk_x11_2_0_so_0.c
U tests/misc/libchk/libglib_2_0_so_0.c
U tests/misc/libchk/libgmodule_2_0_so_0.c
U tests/misc/libchk/libgobject_2_0_so_0.c
U tests/misc/libchk/libgthread_2_0_so_0.c
U tests/misc/libchk/libgtk_x11_2_0_so_0.c
U tests/misc/libchk/libjpeg_so_62.c
U tests/misc/libchk/libm_so_6.c
U tests/misc/libchk/libm_so_6_1.c
U tests/misc/libchk/libncurses_so_5.c
U tests/misc/libchk/libpam_so_0.c
U tests/misc/libchk/libpango_1_0_so_0.c
U tests/misc/libchk/libpangoft2_1_0_so_0.c
U tests/misc/libchk/libpangoxft_1_0_so_0.c
U tests/misc/libchk/libpng12_so_0.c
U tests/misc/libchk/libpthread_so_0.c
U tests/misc/libchk/libqt_mt_so_3.c
U tests/misc/libchk/librt_so_1.c
U tests/misc/libchk/libs.c
U tests/misc/libchk/libs.h
U tests/misc/libchk/libs.mk
U tests/misc/libchk/libstdcxx_so_6.c
U tests/misc/libchk/libutil_so_1.c
U tests/misc/libchk/libxml2_so_2.c
U tests/misc/libchk/libz_so_1.c
U tests/misc/libchk/lsb_linker
U tests/misc/libchk/lsblibchk
U tests/misc/libchk/lsblibchk.1
U tests/misc/libchk/machine_info
U tests/misc/libchk/makefile
U tests/misc/libchk/mkfunclist
U tests/misc/libchk/run_tests
U tests/misc/libchk/test_libchk
OK=0 && while test $OK -ne 1; do cd /home/autobuild/tmp/lsb-libchk-3.0.6.20060403 && cvs -z9 export -D now tests/misc/tetj && OK=1; done
cvs export: Updating tests/misc/tetj
U tests/misc/tetj/Makefile
U tests/misc/tetj/README
U tests/misc/tetj/tetj.3
U tests/misc/tetj/tetj.c
U tests/misc/tetj/tetj.h
U tests/misc/tetj/tetj.py
U tests/misc/tetj/tetjtest.c
cp -pr README Licence Artistic /home/autobuild/tmp/lsb-libchk-3.0.6.20060403
cp -p Makefile.build /home/autobuild/tmp/lsb-libchk-3.0.6.20060403/Makefile
cd /home/autobuild/tmp/lsb-libchk-3.0.6.20060403/.. && tar cvfz /tmp/lsb_autobuild.17676/packaging/lsblibchk/lsb-libchk-3.0.6.20060403.tar.gz lsb-libchk-3.0.6.20060403 && rm -rf /home/autobuild/tmp/lsb-libchk-3.0.6.20060403
lsb-libchk-3.0.6.20060403/
lsb-libchk-3.0.6.20060403/Makefile
lsb-libchk-3.0.6.20060403/README
lsb-libchk-3.0.6.20060403/Licence
lsb-libchk-3.0.6.20060403/Artistic
lsb-libchk-3.0.6.20060403/tests/
lsb-libchk-3.0.6.20060403/tests/misc/
lsb-libchk-3.0.6.20060403/tests/misc/libchk/
lsb-libchk-3.0.6.20060403/tests/misc/libchk/libgdk_pixbuf_xlib_2_0_so_0.c
lsb-libchk-3.0.6.20060403/tests/misc/libchk/libxml2_so_2.c
lsb-libchk-3.0.6.20060403/tests/misc/libchk/libXext_so_6.c
lsb-libchk-3.0.6.20060403/tests/misc/libchk/libgdk_x11_2_0_so_0.c
lsb-libchk-3.0.6.20060403/tests/misc/libchk/libQtSql_so_4.c
lsb-libchk-3.0.6.20060403/tests/misc/libchk/libQtSvg_so_4.c
lsb-libchk-3.0.6.20060403/tests/misc/libchk/libpthread_so_0.c
lsb-libchk-3.0.6.20060403/tests/misc/libchk/libgmodule_2_0_so_0.c
lsb-libchk-3.0.6.20060403/tests/misc/libchk/ld_lsb_so_3.c
lsb-libchk-3.0.6.20060403/tests/misc/libchk/libSM_so_6.c
lsb-libchk-3.0.6.20060403/tests/misc/libchk/libchk.c
lsb-libchk-3.0.6.20060403/tests/misc/libchk/libpangoxft_1_0_so_0.c
lsb-libchk-3.0.6.20060403/tests/misc/libchk/libdb_so_3.c
lsb-libchk-3.0.6.20060403/tests/misc/libchk/README
lsb-libchk-3.0.6.20060403/tests/misc/libchk/libatk_1_0_so_0.c
lsb-libchk-3.0.6.20060403/tests/misc/libchk/libc_so_6.c
lsb-libchk-3.0.6.20060403/tests/misc/libchk/libglib_2_0_so_0.c
lsb-libchk-3.0.6.20060403/tests/misc/libchk/libm_so_6_1.c
lsb-libchk-3.0.6.20060403/tests/misc/libchk/mkfunclist
lsb-libchk-3.0.6.20060403/tests/misc/libchk/libpng12_so_0.c
lsb-libchk-3.0.6.20060403/tests/misc/libchk/libpangoft2_1_0_so_0.c
lsb-libchk-3.0.6.20060403/tests/misc/libchk/lsb_linker
lsb-libchk-3.0.6.20060403/tests/misc/libchk/libgobject_2_0_so_0.c
lsb-libchk-3.0.6.20060403/tests/misc/libchk/librt_so_1.c
lsb-libchk-3.0.6.20060403/tests/misc/libchk/libncurses_so_5.c
lsb-libchk-3.0.6.20060403/tests/misc/libchk/ld_lsb_ppc32_so_3.c
lsb-libchk-3.0.6.20060403/tests/misc/libchk/libs.mk
lsb-libchk-3.0.6.20060403/tests/misc/libchk/libcrypt_so_1.c
lsb-libchk-3.0.6.20060403/tests/misc/libchk/libXi_so_6.c
lsb-libchk-3.0.6.20060403/tests/misc/libchk/dumpints.c
lsb-libchk-3.0.6.20060403/tests/misc/libchk/libpam_so_0.c
lsb-libchk-3.0.6.20060403/tests/misc/libchk/libgtk_x11_2_0_so_0.c
lsb-libchk-3.0.6.20060403/tests/misc/libchk/libX11_so_6.c
lsb-libchk-3.0.6.20060403/tests/misc/libchk/libQtXml_so_4.c
lsb-libchk-3.0.6.20060403/tests/misc/libchk/ld_lsb_s390_so_3.c
lsb-libchk-3.0.6.20060403/tests/misc/libchk/machine_info
lsb-libchk-3.0.6.20060403/tests/misc/libchk/libQtOpenGL_so_4.c
lsb-libchk-3.0.6.20060403/tests/misc/libchk/libgdk_pixbuf_2_0_so_0.c
lsb-libchk-3.0.6.20060403/tests/misc/libchk/libQtGui_so_4.c
lsb-libchk-3.0.6.20060403/tests/misc/libchk/libdl_so_2.c
lsb-libchk-3.0.6.20060403/tests/misc/libchk/ld_lsb_ppc64_so_3.c
lsb-libchk-3.0.6.20060403/tests/misc/libchk/libz_so_1.c
lsb-libchk-3.0.6.20060403/tests/misc/libchk/libm_so_6.c
lsb-libchk-3.0.6.20060403/tests/misc/libchk/License.libchk
lsb-libchk-3.0.6.20060403/tests/misc/libchk/dummy_link.c
lsb-libchk-3.0.6.20060403/tests/misc/libchk/libchk.h
lsb-libchk-3.0.6.20060403/tests/misc/libchk/libICE_so_6.c
lsb-libchk-3.0.6.20060403/tests/misc/libchk/classchk.c
lsb-libchk-3.0.6.20060403/tests/misc/libchk/Artistic
lsb-libchk-3.0.6.20060403/tests/misc/libchk/ld_lsb_s390x_so_3.c
lsb-libchk-3.0.6.20060403/tests/misc/libchk/libs.h
lsb-libchk-3.0.6.20060403/tests/misc/libchk/test_libchk
lsb-libchk-3.0.6.20060403/tests/misc/libchk/libgthread_2_0_so_0.c
lsb-libchk-3.0.6.20060403/tests/misc/libchk/libGL_so_1.c
lsb-libchk-3.0.6.20060403/tests/misc/libchk/libXt_so_6.c
lsb-libchk-3.0.6.20060403/tests/misc/libchk/ld_lsb_x86_64_so_3.c
lsb-libchk-3.0.6.20060403/tests/misc/libchk/libs.c
lsb-libchk-3.0.6.20060403/tests/misc/libchk/libjpeg_so_62.c
lsb-libchk-3.0.6.20060403/tests/misc/libchk/.cvsignore
lsb-libchk-3.0.6.20060403/tests/misc/libchk/libstdcxx_so_6.c
lsb-libchk-3.0.6.20060403/tests/misc/libchk/lsblibchk
lsb-libchk-3.0.6.20060403/tests/misc/libchk/libutil_so_1.c
lsb-libchk-3.0.6.20060403/tests/misc/libchk/run_tests
lsb-libchk-3.0.6.20060403/tests/misc/libchk/libqt_mt_so_3.c
lsb-libchk-3.0.6.20060403/tests/misc/libchk/libgdk_pixbuf_xlib_2_0_so.c
lsb-libchk-3.0.6.20060403/tests/misc/libchk/libpango_1_0_so_0.c
lsb-libchk-3.0.6.20060403/tests/misc/libchk/libc_so_6_1.c
lsb-libchk-3.0.6.20060403/tests/misc/libchk/ld_lsb_ia64_so_3.c
lsb-libchk-3.0.6.20060403/tests/misc/libchk/libfontconfig_so_1.c
lsb-libchk-3.0.6.20060403/tests/misc/libchk/libgcc_s_so_1.c
lsb-libchk-3.0.6.20060403/tests/misc/libchk/libQtNetwork_so_4.c
lsb-libchk-3.0.6.20060403/tests/misc/libchk/makefile
lsb-libchk-3.0.6.20060403/tests/misc/libchk/lsblibchk.1
lsb-libchk-3.0.6.20060403/tests/misc/libchk/libQtCore_so_4.c
lsb-libchk-3.0.6.20060403/tests/misc/elfchk/
lsb-libchk-3.0.6.20060403/tests/misc/elfchk/modules.h
lsb-libchk-3.0.6.20060403/tests/misc/elfchk/progbits.c
lsb-libchk-3.0.6.20060403/tests/misc/elfchk/mkdtneededlist
lsb-libchk-3.0.6.20060403/tests/misc/elfchk/dwarf.c
lsb-libchk-3.0.6.20060403/tests/misc/elfchk/symvers.h
lsb-libchk-3.0.6.20060403/tests/misc/elfchk/note.c
lsb-libchk-3.0.6.20060403/tests/misc/elfchk/hdr.c
lsb-libchk-3.0.6.20060403/tests/misc/elfchk/elfchk.h
lsb-libchk-3.0.6.20060403/tests/misc/elfchk/symvers.c
lsb-libchk-3.0.6.20060403/tests/misc/elfchk/modules.c
lsb-libchk-3.0.6.20060403/tests/misc/elfchk/mkdyntags
lsb-libchk-3.0.6.20060403/tests/misc/elfchk/sections.c
lsb-libchk-3.0.6.20060403/tests/misc/elfchk/hdr.h
lsb-libchk-3.0.6.20060403/tests/misc/elfchk/mkfunclist
lsb-libchk-3.0.6.20060403/tests/misc/elfchk/dump_modules
lsb-libchk-3.0.6.20060403/tests/misc/elfchk/proghdr.h
lsb-libchk-3.0.6.20060403/tests/misc/elfchk/dtneeded.c
lsb-libchk-3.0.6.20060403/tests/misc/elfchk/mksecttype
lsb-libchk-3.0.6.20060403/tests/misc/elfchk/util.c
lsb-libchk-3.0.6.20060403/tests/misc/elfchk/dynamic.c
lsb-libchk-3.0.6.20060403/tests/misc/elfchk/elfchk.c
lsb-libchk-3.0.6.20060403/tests/misc/elfchk/sections.h
lsb-libchk-3.0.6.20060403/tests/misc/elfchk/genit
lsb-libchk-3.0.6.20060403/tests/misc/elfchk/test.c
lsb-libchk-3.0.6.20060403/tests/misc/elfchk/mkfunclist2
lsb-libchk-3.0.6.20060403/tests/misc/elfchk/progbits.h
lsb-libchk-3.0.6.20060403/tests/misc/elfchk/proghdr.c
lsb-libchk-3.0.6.20060403/tests/misc/elfchk/.cvsignore
lsb-libchk-3.0.6.20060403/tests/misc/elfchk/dwarf.h
lsb-libchk-3.0.6.20060403/tests/misc/elfchk/mksectinfo
lsb-libchk-3.0.6.20060403/tests/misc/elfchk/dumpbytes.c
lsb-libchk-3.0.6.20060403/tests/misc/elfchk/secttype.c
lsb-libchk-3.0.6.20060403/tests/misc/elfchk/sectinfo.c
lsb-libchk-3.0.6.20060403/tests/misc/elfchk/dwarf2.h
lsb-libchk-3.0.6.20060403/tests/misc/elfchk/dyntags.c
lsb-libchk-3.0.6.20060403/tests/misc/elfchk/dynamic.h
lsb-libchk-3.0.6.20060403/tests/misc/elfchk/makefile
lsb-libchk-3.0.6.20060403/tests/misc/elfchk/proginterp.c
lsb-libchk-3.0.6.20060403/tests/misc/elfchk/dynsyms.c
lsb-libchk-3.0.6.20060403/tests/misc/tetj/
lsb-libchk-3.0.6.20060403/tests/misc/tetj/Makefile
lsb-libchk-3.0.6.20060403/tests/misc/tetj/tetj.3
lsb-libchk-3.0.6.20060403/tests/misc/tetj/tetjtest.c
lsb-libchk-3.0.6.20060403/tests/misc/tetj/README
lsb-libchk-3.0.6.20060403/tests/misc/tetj/tetj.c
lsb-libchk-3.0.6.20060403/tests/misc/tetj/tetj.h
lsb-libchk-3.0.6.20060403/tests/misc/tetj/tetj.py
spawn rpmbuild --sign --rcfile /usr/lib/rpm/rpmrc:../rpmrc:~/.rpmrc --define=_sourcedir /tmp/lsb_autobuild.17676/packaging/lsblibchk --define=buildroot /home/autobuild/tmp/lsb-libchk-3.0.6.20060403 --define=_topdir /home/autobuild/tmp/rpm-build --define=_target_cpu ppc -bb lsb-libchk.spec
Enter pass phrase: 
Pass phrase is good.
Executing(%prep): /bin/sh -e /var/tmp/rpm-tmp.76159
+ umask 022
+ cd /home/autobuild/tmp/rpm-build/BUILD
+ cd /home/autobuild/tmp/rpm-build/BUILD
+ rm -rf lsb-libchk-3.0.6.20060403
+ /usr/bin/gzip -dc /tmp/lsb_autobuild.17676/packaging/lsblibchk/lsb-libchk-3.0.6.20060403.tar.gz
+ tar -xf -
+ STATUS=0
+ '[' 0 -ne 0 ']'
+ cd lsb-libchk-3.0.6.20060403
+ exit 0
Executing(%build): /bin/sh -e /var/tmp/rpm-tmp.76159
+ umask 022
+ cd /home/autobuild/tmp/rpm-build/BUILD
+ cd lsb-libchk-3.0.6.20060403
+ CC=/opt/lsb/bin/lsbcc
+ CXX=/opt/lsb/bin/lsbc++
+ LSB_PRODUCT=desktop
+ LSB_MODULES=qt4
+ make LSBVERSION=3.0.6.20060403 LSBLIBCHK_VERSION=3.0.6.20060403-1 all test
make[1]: Entering directory `/home/autobuild/tmp/rpm-build/BUILD/lsb-libchk-3.0.6.20060403'
cd tests/misc/tetj && make
make[2]: Entering directory `/home/autobuild/tmp/rpm-build/BUILD/lsb-libchk-3.0.6.20060403/tests/misc/tetj'
/opt/lsb/bin/lsbcc -g -Wall   -c -o tetj.o tetj.c
make[2]: /opt/lsb/bin/lsbcc: Command not found
make[2]: *** [tetj.o] Error 127
make[2]: Leaving directory `/home/autobuild/tmp/rpm-build/BUILD/lsb-libchk-3.0.6.20060403/tests/misc/tetj'
make[1]: *** [all] Error 2
make[1]: Leaving directory `/home/autobuild/tmp/rpm-build/BUILD/lsb-libchk-3.0.6.20060403'
error: Bad exit status from /var/tmp/rpm-tmp.76159 (%build)


RPM build errors:
    Bad exit status from /var/tmp/rpm-tmp.76159 (%build)
expect: spawn id exp3 not open
    while executing
"expect "exit 0""
send: spawn id exp3 not open
    while executing
"send "\n""
mv: cannot stat `/home/autobuild/tmp/rpm-build/RPMS/ppc/lsb-libchk-3.0.6.20060403-1.ppc.rpm': No such file or directory
make: *** [lsb-libchk-3.0.6.20060403-1.ppc.rpm] Error 1



More information about the lsb-autobuild mailing list