[Lsb-autobuild] Build failure for lsblibchk on x86_64

lsb-autobuild at freestandards.org lsb-autobuild at freestandards.org
Wed Jun 14 01:05:24 PDT 2006


This is an automated message generated when a build failure occurs

Linux build0-amd64 2.6.12-1-amd64-k8 #1 Wed Sep 28 02:31:26 CEST 2005 x86_64 x86_64 x86_64 GNU/Linux
Failed to make packages for lsblibchk
if test ! -e .need_config_update || test 3.1.1.20060614-1 != `cat .need_config_update`; \
  then echo 3.1.1.20060614-1 > .need_config_update; \
fi
sed -e "s#@LSBVERSION@#`echo 3.1.1.20060614`#" -e "s#@PACKAGE_RELEASE@#`echo 1`#" < lsb-libchk.spec.sed > lsb-libchk.spec
if [ -e /home/autobuild/tmp/lsb-libchk-3.1.1.20060614 ]; then rm -rf /home/autobuild/tmp/lsb-libchk-3.1.1.20060614; fi
mkdir -p /home/autobuild/tmp/lsb-libchk-3.1.1.20060614
OK=0 && while test $OK -ne 1; do cd /home/autobuild/tmp/lsb-libchk-3.1.1.20060614 && cvs -z9 export -D now tests/misc/elfchk && OK=1; done
cvs export: Updating tests/misc/elfchk
U tests/misc/elfchk/.cvsignore
U tests/misc/elfchk/dtneeded.c
U tests/misc/elfchk/dump_modules
U tests/misc/elfchk/dumpbytes.c
U tests/misc/elfchk/dwarf.c
U tests/misc/elfchk/dwarf.h
U tests/misc/elfchk/dwarf2.h
U tests/misc/elfchk/dynamic.c
U tests/misc/elfchk/dynamic.h
U tests/misc/elfchk/dynsyms.c
U tests/misc/elfchk/dyntags.c
U tests/misc/elfchk/elfchk.c
U tests/misc/elfchk/elfchk.h
U tests/misc/elfchk/genit
U tests/misc/elfchk/hdr.c
U tests/misc/elfchk/hdr.h
U tests/misc/elfchk/makefile
U tests/misc/elfchk/mkdtneededlist
U tests/misc/elfchk/mkdyntags
U tests/misc/elfchk/mkfunclist
U tests/misc/elfchk/mkfunclist2
U tests/misc/elfchk/mksectinfo
U tests/misc/elfchk/mksecttype
U tests/misc/elfchk/modules.c
U tests/misc/elfchk/modules.h
U tests/misc/elfchk/note.c
U tests/misc/elfchk/progbits.c
U tests/misc/elfchk/progbits.h
U tests/misc/elfchk/proghdr.c
U tests/misc/elfchk/proghdr.h
U tests/misc/elfchk/proginterp.c
U tests/misc/elfchk/sectinfo.c
U tests/misc/elfchk/sections.c
U tests/misc/elfchk/sections.h
U tests/misc/elfchk/secttype.c
U tests/misc/elfchk/symvers.c
U tests/misc/elfchk/symvers.h
U tests/misc/elfchk/test.c
U tests/misc/elfchk/util.c
OK=0 && while test $OK -ne 1; do cd /home/autobuild/tmp/lsb-libchk-3.1.1.20060614 && cvs -z9 export -D now tests/misc/libchk && OK=1; done
cvs export: Updating tests/misc/libchk
U tests/misc/libchk/.cvsignore
U tests/misc/libchk/Artistic
U tests/misc/libchk/License.libchk
U tests/misc/libchk/README
U tests/misc/libchk/classchk.c
U tests/misc/libchk/dummy_link.c
U tests/misc/libchk/dumpints.c
U tests/misc/libchk/ld_lsb_ia64_so_3.c
U tests/misc/libchk/ld_lsb_ppc32_so_3.c
U tests/misc/libchk/ld_lsb_ppc64_so_3.c
U tests/misc/libchk/ld_lsb_s390_so_3.c
U tests/misc/libchk/ld_lsb_s390x_so_3.c
U tests/misc/libchk/ld_lsb_so_3.c
U tests/misc/libchk/ld_lsb_x86_64_so_3.c
U tests/misc/libchk/libGL_so_1.c
U tests/misc/libchk/libICE_so_6.c
U tests/misc/libchk/libQtCore_so_4.c
U tests/misc/libchk/libQtGui_so_4.c
U tests/misc/libchk/libQtNetwork_so_4.c
U tests/misc/libchk/libQtOpenGL_so_4.c
U tests/misc/libchk/libQtSql_so_4.c
U tests/misc/libchk/libQtSvg_so_4.c
U tests/misc/libchk/libQtXml_so_4.c
U tests/misc/libchk/libSM_so_6.c
U tests/misc/libchk/libX11_so_6.c
U tests/misc/libchk/libXext_so_6.c
U tests/misc/libchk/libXi_so_6.c
U tests/misc/libchk/libXt_so_6.c
U tests/misc/libchk/libatk_1_0_so_0.c
U tests/misc/libchk/libc_so_6.c
U tests/misc/libchk/libc_so_6_1.c
U tests/misc/libchk/libchk.c
U tests/misc/libchk/libchk.h
U tests/misc/libchk/libcrypt_so_1.c
U tests/misc/libchk/libdb_so_3.c
U tests/misc/libchk/libdl_so_2.c
U tests/misc/libchk/libfontconfig_so_1.c
U tests/misc/libchk/libgcc_s_so_1.c
U tests/misc/libchk/libgdk_pixbuf_2_0_so_0.c
U tests/misc/libchk/libgdk_pixbuf_xlib_2_0_so.c
U tests/misc/libchk/libgdk_pixbuf_xlib_2_0_so_0.c
U tests/misc/libchk/libgdk_x11_2_0_so_0.c
U tests/misc/libchk/libglib_2_0_so_0.c
U tests/misc/libchk/libgmodule_2_0_so_0.c
U tests/misc/libchk/libgobject_2_0_so_0.c
U tests/misc/libchk/libgthread_2_0_so_0.c
U tests/misc/libchk/libgtk_x11_2_0_so_0.c
U tests/misc/libchk/libjpeg_so_62.c
U tests/misc/libchk/libm_so_6.c
U tests/misc/libchk/libm_so_6_1.c
U tests/misc/libchk/libncurses_so_5.c
U tests/misc/libchk/libpam_so_0.c
U tests/misc/libchk/libpango_1_0_so_0.c
U tests/misc/libchk/libpangoft2_1_0_so_0.c
U tests/misc/libchk/libpangoxft_1_0_so_0.c
U tests/misc/libchk/libpng12_so_0.c
U tests/misc/libchk/libpthread_so_0.c
U tests/misc/libchk/libqt_mt_so_3.c
U tests/misc/libchk/librt_so_1.c
U tests/misc/libchk/libs.c
U tests/misc/libchk/libs.h
U tests/misc/libchk/libs.mk
U tests/misc/libchk/libstdcxx_so_6.c
U tests/misc/libchk/libutil_so_1.c
U tests/misc/libchk/libxml2_so_2.c
U tests/misc/libchk/libz_so_1.c
U tests/misc/libchk/lsb_linker
U tests/misc/libchk/lsblibchk
U tests/misc/libchk/lsblibchk.1
U tests/misc/libchk/machine_info
U tests/misc/libchk/makefile
U tests/misc/libchk/mkfunclist
U tests/misc/libchk/run_tests
U tests/misc/libchk/test_libchk
OK=0 && while test $OK -ne 1; do cd /home/autobuild/tmp/lsb-libchk-3.1.1.20060614 && cvs -z9 export -D now tests/misc/tetj && OK=1; done
cvs export: Updating tests/misc/tetj
U tests/misc/tetj/Makefile
U tests/misc/tetj/README
U tests/misc/tetj/tetj.3
U tests/misc/tetj/tetj.c
U tests/misc/tetj/tetj.h
U tests/misc/tetj/tetj.py
U tests/misc/tetj/tetjtest.c
cp -pr README Licence Artistic /home/autobuild/tmp/lsb-libchk-3.1.1.20060614
cp -p Makefile.build /home/autobuild/tmp/lsb-libchk-3.1.1.20060614/Makefile
cd /home/autobuild/tmp/lsb-libchk-3.1.1.20060614/.. && tar cvfz /tmp/lsb_autobuild.22201/packaging/lsblibchk/lsb-libchk-3.1.1.20060614.tar.gz lsb-libchk-3.1.1.20060614 && rm -rf /home/autobuild/tmp/lsb-libchk-3.1.1.20060614
lsb-libchk-3.1.1.20060614/
lsb-libchk-3.1.1.20060614/tests/
lsb-libchk-3.1.1.20060614/tests/misc/
lsb-libchk-3.1.1.20060614/tests/misc/elfchk/
lsb-libchk-3.1.1.20060614/tests/misc/elfchk/.cvsignore
lsb-libchk-3.1.1.20060614/tests/misc/elfchk/dtneeded.c
lsb-libchk-3.1.1.20060614/tests/misc/elfchk/dump_modules
lsb-libchk-3.1.1.20060614/tests/misc/elfchk/dumpbytes.c
lsb-libchk-3.1.1.20060614/tests/misc/elfchk/dwarf.c
lsb-libchk-3.1.1.20060614/tests/misc/elfchk/dwarf.h
lsb-libchk-3.1.1.20060614/tests/misc/elfchk/dwarf2.h
lsb-libchk-3.1.1.20060614/tests/misc/elfchk/dynamic.c
lsb-libchk-3.1.1.20060614/tests/misc/elfchk/dynamic.h
lsb-libchk-3.1.1.20060614/tests/misc/elfchk/dynsyms.c
lsb-libchk-3.1.1.20060614/tests/misc/elfchk/dyntags.c
lsb-libchk-3.1.1.20060614/tests/misc/elfchk/elfchk.c
lsb-libchk-3.1.1.20060614/tests/misc/elfchk/elfchk.h
lsb-libchk-3.1.1.20060614/tests/misc/elfchk/genit
lsb-libchk-3.1.1.20060614/tests/misc/elfchk/hdr.c
lsb-libchk-3.1.1.20060614/tests/misc/elfchk/hdr.h
lsb-libchk-3.1.1.20060614/tests/misc/elfchk/makefile
lsb-libchk-3.1.1.20060614/tests/misc/elfchk/mkdtneededlist
lsb-libchk-3.1.1.20060614/tests/misc/elfchk/mkdyntags
lsb-libchk-3.1.1.20060614/tests/misc/elfchk/mkfunclist
lsb-libchk-3.1.1.20060614/tests/misc/elfchk/mkfunclist2
lsb-libchk-3.1.1.20060614/tests/misc/elfchk/mksectinfo
lsb-libchk-3.1.1.20060614/tests/misc/elfchk/mksecttype
lsb-libchk-3.1.1.20060614/tests/misc/elfchk/modules.c
lsb-libchk-3.1.1.20060614/tests/misc/elfchk/modules.h
lsb-libchk-3.1.1.20060614/tests/misc/elfchk/note.c
lsb-libchk-3.1.1.20060614/tests/misc/elfchk/progbits.c
lsb-libchk-3.1.1.20060614/tests/misc/elfchk/progbits.h
lsb-libchk-3.1.1.20060614/tests/misc/elfchk/proghdr.c
lsb-libchk-3.1.1.20060614/tests/misc/elfchk/proghdr.h
lsb-libchk-3.1.1.20060614/tests/misc/elfchk/proginterp.c
lsb-libchk-3.1.1.20060614/tests/misc/elfchk/sectinfo.c
lsb-libchk-3.1.1.20060614/tests/misc/elfchk/sections.c
lsb-libchk-3.1.1.20060614/tests/misc/elfchk/sections.h
lsb-libchk-3.1.1.20060614/tests/misc/elfchk/secttype.c
lsb-libchk-3.1.1.20060614/tests/misc/elfchk/symvers.c
lsb-libchk-3.1.1.20060614/tests/misc/elfchk/symvers.h
lsb-libchk-3.1.1.20060614/tests/misc/elfchk/test.c
lsb-libchk-3.1.1.20060614/tests/misc/elfchk/util.c
lsb-libchk-3.1.1.20060614/tests/misc/libchk/
lsb-libchk-3.1.1.20060614/tests/misc/libchk/.cvsignore
lsb-libchk-3.1.1.20060614/tests/misc/libchk/Artistic
lsb-libchk-3.1.1.20060614/tests/misc/libchk/License.libchk
lsb-libchk-3.1.1.20060614/tests/misc/libchk/README
lsb-libchk-3.1.1.20060614/tests/misc/libchk/classchk.c
lsb-libchk-3.1.1.20060614/tests/misc/libchk/dummy_link.c
lsb-libchk-3.1.1.20060614/tests/misc/libchk/dumpints.c
lsb-libchk-3.1.1.20060614/tests/misc/libchk/ld_lsb_ia64_so_3.c
lsb-libchk-3.1.1.20060614/tests/misc/libchk/ld_lsb_ppc32_so_3.c
lsb-libchk-3.1.1.20060614/tests/misc/libchk/ld_lsb_ppc64_so_3.c
lsb-libchk-3.1.1.20060614/tests/misc/libchk/ld_lsb_s390_so_3.c
lsb-libchk-3.1.1.20060614/tests/misc/libchk/ld_lsb_s390x_so_3.c
lsb-libchk-3.1.1.20060614/tests/misc/libchk/ld_lsb_so_3.c
lsb-libchk-3.1.1.20060614/tests/misc/libchk/ld_lsb_x86_64_so_3.c
lsb-libchk-3.1.1.20060614/tests/misc/libchk/libGL_so_1.c
lsb-libchk-3.1.1.20060614/tests/misc/libchk/libICE_so_6.c
lsb-libchk-3.1.1.20060614/tests/misc/libchk/libQtCore_so_4.c
lsb-libchk-3.1.1.20060614/tests/misc/libchk/libQtGui_so_4.c
lsb-libchk-3.1.1.20060614/tests/misc/libchk/libQtNetwork_so_4.c
lsb-libchk-3.1.1.20060614/tests/misc/libchk/libQtOpenGL_so_4.c
lsb-libchk-3.1.1.20060614/tests/misc/libchk/libQtSql_so_4.c
lsb-libchk-3.1.1.20060614/tests/misc/libchk/libQtSvg_so_4.c
lsb-libchk-3.1.1.20060614/tests/misc/libchk/libQtXml_so_4.c
lsb-libchk-3.1.1.20060614/tests/misc/libchk/libSM_so_6.c
lsb-libchk-3.1.1.20060614/tests/misc/libchk/libX11_so_6.c
lsb-libchk-3.1.1.20060614/tests/misc/libchk/libXext_so_6.c
lsb-libchk-3.1.1.20060614/tests/misc/libchk/libXi_so_6.c
lsb-libchk-3.1.1.20060614/tests/misc/libchk/libXt_so_6.c
lsb-libchk-3.1.1.20060614/tests/misc/libchk/libatk_1_0_so_0.c
lsb-libchk-3.1.1.20060614/tests/misc/libchk/libc_so_6.c
lsb-libchk-3.1.1.20060614/tests/misc/libchk/libc_so_6_1.c
lsb-libchk-3.1.1.20060614/tests/misc/libchk/libchk.c
lsb-libchk-3.1.1.20060614/tests/misc/libchk/libchk.h
lsb-libchk-3.1.1.20060614/tests/misc/libchk/libcrypt_so_1.c
lsb-libchk-3.1.1.20060614/tests/misc/libchk/libdb_so_3.c
lsb-libchk-3.1.1.20060614/tests/misc/libchk/libdl_so_2.c
lsb-libchk-3.1.1.20060614/tests/misc/libchk/libfontconfig_so_1.c
lsb-libchk-3.1.1.20060614/tests/misc/libchk/libgcc_s_so_1.c
lsb-libchk-3.1.1.20060614/tests/misc/libchk/libgdk_pixbuf_2_0_so_0.c
lsb-libchk-3.1.1.20060614/tests/misc/libchk/libgdk_pixbuf_xlib_2_0_so.c
lsb-libchk-3.1.1.20060614/tests/misc/libchk/libgdk_pixbuf_xlib_2_0_so_0.c
lsb-libchk-3.1.1.20060614/tests/misc/libchk/libgdk_x11_2_0_so_0.c
lsb-libchk-3.1.1.20060614/tests/misc/libchk/libglib_2_0_so_0.c
lsb-libchk-3.1.1.20060614/tests/misc/libchk/libgmodule_2_0_so_0.c
lsb-libchk-3.1.1.20060614/tests/misc/libchk/libgobject_2_0_so_0.c
lsb-libchk-3.1.1.20060614/tests/misc/libchk/libgthread_2_0_so_0.c
lsb-libchk-3.1.1.20060614/tests/misc/libchk/libgtk_x11_2_0_so_0.c
lsb-libchk-3.1.1.20060614/tests/misc/libchk/libjpeg_so_62.c
lsb-libchk-3.1.1.20060614/tests/misc/libchk/libm_so_6.c
lsb-libchk-3.1.1.20060614/tests/misc/libchk/libm_so_6_1.c
lsb-libchk-3.1.1.20060614/tests/misc/libchk/libncurses_so_5.c
lsb-libchk-3.1.1.20060614/tests/misc/libchk/libpam_so_0.c
lsb-libchk-3.1.1.20060614/tests/misc/libchk/libpango_1_0_so_0.c
lsb-libchk-3.1.1.20060614/tests/misc/libchk/libpangoft2_1_0_so_0.c
lsb-libchk-3.1.1.20060614/tests/misc/libchk/libpangoxft_1_0_so_0.c
lsb-libchk-3.1.1.20060614/tests/misc/libchk/libpng12_so_0.c
lsb-libchk-3.1.1.20060614/tests/misc/libchk/libpthread_so_0.c
lsb-libchk-3.1.1.20060614/tests/misc/libchk/libqt_mt_so_3.c
lsb-libchk-3.1.1.20060614/tests/misc/libchk/librt_so_1.c
lsb-libchk-3.1.1.20060614/tests/misc/libchk/libs.c
lsb-libchk-3.1.1.20060614/tests/misc/libchk/libs.h
lsb-libchk-3.1.1.20060614/tests/misc/libchk/libs.mk
lsb-libchk-3.1.1.20060614/tests/misc/libchk/libstdcxx_so_6.c
lsb-libchk-3.1.1.20060614/tests/misc/libchk/libutil_so_1.c
lsb-libchk-3.1.1.20060614/tests/misc/libchk/libxml2_so_2.c
lsb-libchk-3.1.1.20060614/tests/misc/libchk/libz_so_1.c
lsb-libchk-3.1.1.20060614/tests/misc/libchk/lsb_linker
lsb-libchk-3.1.1.20060614/tests/misc/libchk/lsblibchk
lsb-libchk-3.1.1.20060614/tests/misc/libchk/lsblibchk.1
lsb-libchk-3.1.1.20060614/tests/misc/libchk/machine_info
lsb-libchk-3.1.1.20060614/tests/misc/libchk/makefile
lsb-libchk-3.1.1.20060614/tests/misc/libchk/mkfunclist
lsb-libchk-3.1.1.20060614/tests/misc/libchk/run_tests
lsb-libchk-3.1.1.20060614/tests/misc/libchk/test_libchk
lsb-libchk-3.1.1.20060614/tests/misc/tetj/
lsb-libchk-3.1.1.20060614/tests/misc/tetj/Makefile
lsb-libchk-3.1.1.20060614/tests/misc/tetj/README
lsb-libchk-3.1.1.20060614/tests/misc/tetj/tetj.3
lsb-libchk-3.1.1.20060614/tests/misc/tetj/tetj.c
lsb-libchk-3.1.1.20060614/tests/misc/tetj/tetj.h
lsb-libchk-3.1.1.20060614/tests/misc/tetj/tetj.py
lsb-libchk-3.1.1.20060614/tests/misc/tetj/tetjtest.c
lsb-libchk-3.1.1.20060614/README
lsb-libchk-3.1.1.20060614/Licence
lsb-libchk-3.1.1.20060614/Artistic
lsb-libchk-3.1.1.20060614/Makefile
spawn rpmbuild --sign --rcfile /usr/lib/rpm/rpmrc:../rpmrc:~/.rpmrc --define=_sourcedir /tmp/lsb_autobuild.22201/packaging/lsblibchk --define=buildroot /home/autobuild/tmp/lsb-libchk-3.1.1.20060614 --define=_topdir /home/autobuild/tmp/rpm-build --define=_target_cpu x86_64 -bb lsb-libchk.spec
Enter pass phrase: 
Pass phrase is good.
Executing(%prep): /bin/sh -e /var/tmp/rpm-tmp.74523
+ umask 022
+ cd /home/autobuild/tmp/rpm-build/BUILD
+ cd /home/autobuild/tmp/rpm-build/BUILD
+ rm -rf lsb-libchk-3.1.1.20060614
+ /usr/bin/gzip -dc /tmp/lsb_autobuild.22201/packaging/lsblibchk/lsb-libchk-3.1.1.20060614.tar.gz
+ tar -xf -
+ STATUS=0
+ '[' 0 -ne 0 ']'
+ cd lsb-libchk-3.1.1.20060614
+ exit 0
Executing(%build): /bin/sh -e /var/tmp/rpm-tmp.74523
+ umask 022
+ cd /home/autobuild/tmp/rpm-build/BUILD
+ cd lsb-libchk-3.1.1.20060614
+ CC=/opt/lsb/bin/lsbcc
+ CXX=/opt/lsb/bin/lsbc++
+ LSB_PRODUCT=desktop
+ LSB_MODULES=qt4
+ make LSBVERSION=3.1.1.20060614 LSBLIBCHK_VERSION=3.1.1.20060614-1 all test
make[1]: Entering directory `/home/autobuild/tmp/rpm-build/BUILD/lsb-libchk-3.1.1.20060614'
cd tests/misc/tetj && make
make[2]: Entering directory `/home/autobuild/tmp/rpm-build/BUILD/lsb-libchk-3.1.1.20060614/tests/misc/tetj'
/opt/lsb/bin/lsbcc -g -Wall   -c -o tetj.o tetj.c
rm -f libtetj.a;ar clq libtetj.a tetj.o
make[2]: Leaving directory `/home/autobuild/tmp/rpm-build/BUILD/lsb-libchk-3.1.1.20060614/tests/misc/tetj'
cd tests/misc/elfchk && make
make[2]: Entering directory `/home/autobuild/tmp/rpm-build/BUILD/lsb-libchk-3.1.1.20060614/tests/misc/elfchk'
/opt/lsb/bin/lsbcc -g -Wall -I../tetj   -c -o dynsyms.o dynsyms.c
/opt/lsb/bin/lsbcc -g -Wall -I../tetj   -c -o dynamic.o dynamic.c
/opt/lsb/bin/lsbcc -g -Wall -I../tetj   -c -o dyntags.o dyntags.c
/opt/lsb/bin/lsbcc -g -Wall -I../tetj   -c -o dtneeded.o dtneeded.c
/opt/lsb/bin/lsbcc -g -Wall -I../tetj   -c -o elfchk.o elfchk.c
/opt/lsb/bin/lsbcc -g -Wall -I../tetj   -c -o hdr.o hdr.c
/opt/lsb/bin/lsbcc -g -Wall -I../tetj   -c -o proghdr.o proghdr.c
/opt/lsb/bin/lsbcc -g -Wall -I../tetj   -c -o sectinfo.o sectinfo.c
/opt/lsb/bin/lsbcc -g -Wall -I../tetj   -c -o sections.o sections.c
/opt/lsb/bin/lsbcc -g -Wall -I../tetj   -c -o symvers.o symvers.c
/opt/lsb/bin/lsbcc -g -Wall -I../tetj   -c -o util.o util.c
/opt/lsb/bin/lsbcc -g -Wall -I../tetj   -c -o proginterp.o proginterp.c
/opt/lsb/bin/lsbcc -g -Wall -I../tetj   -c -o progbits.o progbits.c
/opt/lsb/bin/lsbcc -g -Wall -I../tetj   -c -o note.o note.c
/opt/lsb/bin/lsbcc -g -Wall -I../tetj   -c -o dumpbytes.o dumpbytes.c
/opt/lsb/bin/lsbcc -g -Wall -I../tetj   -c -o dwarf.o dwarf.c
/opt/lsb/bin/lsbcc -g -Wall -I../tetj   -c -o secttype.o secttype.c
/opt/lsb/bin/lsbcc -g -Wall -I../tetj   -c -o modules.o modules.c
rm -f libelfchk.a;ar clq libelfchk.a dynsyms.o dynamic.o dyntags.o dtneeded.o elfchk.o hdr.o proghdr.o sectinfo.o sections.o symvers.o util.o proginterp.o progbits.o note.o dumpbytes.o dwarf.o secttype.o modules.o
cc -o test -g -Wall -I../tetj test.c libelfchk.a ../tetj/libtetj.a
make[2]: Leaving directory `/home/autobuild/tmp/rpm-build/BUILD/lsb-libchk-3.1.1.20060614/tests/misc/elfchk'
cd tests/misc/libchk && make
make[2]: Entering directory `/home/autobuild/tmp/rpm-build/BUILD/lsb-libchk-3.1.1.20060614/tests/misc/libchk'
/opt/lsb/bin/lsbcc -g -I../elfchk -I../tetj -DLSBVERSION=\"$LSBVERSION\" -DLSBLIBCHK_VERSION=\"3.1.1.20060614-1\" -Wall   -c -o libchk.o libchk.c
libchk.c: In function `check_lib':
libchk.c:732: warning: passing arg 3 of `check_class_info' from incompatible pointer type
/opt/lsb/bin/lsbcc -g -I../elfchk -I../tetj -DLSBVERSION=\"$LSBVERSION\" -DLSBLIBCHK_VERSION=\"3.1.1.20060614-1\" -Wall   -c -o libs.o libs.c
/opt/lsb/bin/lsbcc -g -I../elfchk -I../tetj -DLSBVERSION=\"$LSBVERSION\" -DLSBLIBCHK_VERSION=\"3.1.1.20060614-1\" -Wall   -c -o classchk.o classchk.c
classchk.c:1:1: warning: "_GNU_SOURCE" redefined
<command line>:8:1: warning: this is the location of the previous definition
classchk.c: In function `check_class_info':
classchk.c:692: warning: int format, different type arg (arg 5)
/opt/lsb/bin/lsbcc -g -I../elfchk -I../tetj -DLSBVERSION=\"$LSBVERSION\" -DLSBLIBCHK_VERSION=\"3.1.1.20060614-1\" -Wall   -c -o ld_lsb_ia64_so_3.o ld_lsb_ia64_so_3.c
/opt/lsb/bin/lsbcc -g -I../elfchk -I../tetj -DLSBVERSION=\"$LSBVERSION\" -DLSBLIBCHK_VERSION=\"3.1.1.20060614-1\" -Wall   -c -o ld_lsb_ppc32_so_3.o ld_lsb_ppc32_so_3.c
/opt/lsb/bin/lsbcc -g -I../elfchk -I../tetj -DLSBVERSION=\"$LSBVERSION\" -DLSBLIBCHK_VERSION=\"3.1.1.20060614-1\" -Wall   -c -o ld_lsb_s390_so_3.o ld_lsb_s390_so_3.c
/opt/lsb/bin/lsbcc -g -I../elfchk -I../tetj -DLSBVERSION=\"$LSBVERSION\" -DLSBLIBCHK_VERSION=\"3.1.1.20060614-1\" -Wall   -c -o ld_lsb_so_3.o ld_lsb_so_3.c
/opt/lsb/bin/lsbcc -g -I../elfchk -I../tetj -DLSBVERSION=\"$LSBVERSION\" -DLSBLIBCHK_VERSION=\"3.1.1.20060614-1\" -Wall   -c -o ld_lsb_ppc64_so_3.o ld_lsb_ppc64_so_3.c
/opt/lsb/bin/lsbcc -g -I../elfchk -I../tetj -DLSBVERSION=\"$LSBVERSION\" -DLSBLIBCHK_VERSION=\"3.1.1.20060614-1\" -Wall   -c -o ld_lsb_s390x_so_3.o ld_lsb_s390x_so_3.c
/opt/lsb/bin/lsbcc -g -I../elfchk -I../tetj -DLSBVERSION=\"$LSBVERSION\" -DLSBLIBCHK_VERSION=\"3.1.1.20060614-1\" -Wall   -c -o ld_lsb_x86_64_so_3.o ld_lsb_x86_64_so_3.c
/opt/lsb/bin/lsbcc -g -I../elfchk -I../tetj -DLSBVERSION=\"$LSBVERSION\" -DLSBLIBCHK_VERSION=\"3.1.1.20060614-1\" -Wall   -c -o libatk_1_0_so_0.o libatk_1_0_so_0.c
/opt/lsb/bin/lsbcc -g -I../elfchk -I../tetj -DLSBVERSION=\"$LSBVERSION\" -DLSBLIBCHK_VERSION=\"3.1.1.20060614-1\" -Wall   -c -o libc_so_6.o libc_so_6.c
/opt/lsb/bin/lsbcc -g -I../elfchk -I../tetj -DLSBVERSION=\"$LSBVERSION\" -DLSBLIBCHK_VERSION=\"3.1.1.20060614-1\" -Wall   -c -o libc_so_6_1.o libc_so_6_1.c
/opt/lsb/bin/lsbcc -g -I../elfchk -I../tetj -DLSBVERSION=\"$LSBVERSION\" -DLSBLIBCHK_VERSION=\"3.1.1.20060614-1\" -Wall   -c -o libcrypt_so_1.o libcrypt_so_1.c
/opt/lsb/bin/lsbcc -g -I../elfchk -I../tetj -DLSBVERSION=\"$LSBVERSION\" -DLSBLIBCHK_VERSION=\"3.1.1.20060614-1\" -Wall   -c -o libdl_so_2.o libdl_so_2.c
/opt/lsb/bin/lsbcc -g -I../elfchk -I../tetj -DLSBVERSION=\"$LSBVERSION\" -DLSBLIBCHK_VERSION=\"3.1.1.20060614-1\" -Wall   -c -o libfontconfig_so_1.o libfontconfig_so_1.c
/opt/lsb/bin/lsbcc -g -I../elfchk -I../tetj -DLSBVERSION=\"$LSBVERSION\" -DLSBLIBCHK_VERSION=\"3.1.1.20060614-1\" -Wall   -c -o libgcc_s_so_1.o libgcc_s_so_1.c
/opt/lsb/bin/lsbcc -g -I../elfchk -I../tetj -DLSBVERSION=\"$LSBVERSION\" -DLSBLIBCHK_VERSION=\"3.1.1.20060614-1\" -Wall   -c -o libgdk_x11_2_0_so_0.o libgdk_x11_2_0_so_0.c
/opt/lsb/bin/lsbcc -g -I../elfchk -I../tetj -DLSBVERSION=\"$LSBVERSION\" -DLSBLIBCHK_VERSION=\"3.1.1.20060614-1\" -Wall   -c -o libgdk_pixbuf_2_0_so_0.o libgdk_pixbuf_2_0_so_0.c
/opt/lsb/bin/lsbcc -g -I../elfchk -I../tetj -DLSBVERSION=\"$LSBVERSION\" -DLSBLIBCHK_VERSION=\"3.1.1.20060614-1\" -Wall   -c -o libgdk_pixbuf_xlib_2_0_so_0.o libgdk_pixbuf_xlib_2_0_so_0.c
/opt/lsb/bin/lsbcc -g -I../elfchk -I../tetj -DLSBVERSION=\"$LSBVERSION\" -DLSBLIBCHK_VERSION=\"3.1.1.20060614-1\" -Wall   -c -o libGL_so_1.o libGL_so_1.c
/opt/lsb/bin/lsbcc -g -I../elfchk -I../tetj -DLSBVERSION=\"$LSBVERSION\" -DLSBLIBCHK_VERSION=\"3.1.1.20060614-1\" -Wall   -c -o libglib_2_0_so_0.o libglib_2_0_so_0.c
/opt/lsb/bin/lsbcc -g -I../elfchk -I../tetj -DLSBVERSION=\"$LSBVERSION\" -DLSBLIBCHK_VERSION=\"3.1.1.20060614-1\" -Wall   -c -o libgmodule_2_0_so_0.o libgmodule_2_0_so_0.c
/opt/lsb/bin/lsbcc -g -I../elfchk -I../tetj -DLSBVERSION=\"$LSBVERSION\" -DLSBLIBCHK_VERSION=\"3.1.1.20060614-1\" -Wall   -c -o libgobject_2_0_so_0.o libgobject_2_0_so_0.c
/opt/lsb/bin/lsbcc -g -I../elfchk -I../tetj -DLSBVERSION=\"$LSBVERSION\" -DLSBLIBCHK_VERSION=\"3.1.1.20060614-1\" -Wall   -c -o libgthread_2_0_so_0.o libgthread_2_0_so_0.c
/opt/lsb/bin/lsbcc -g -I../elfchk -I../tetj -DLSBVERSION=\"$LSBVERSION\" -DLSBLIBCHK_VERSION=\"3.1.1.20060614-1\" -Wall   -c -o libgtk_x11_2_0_so_0.o libgtk_x11_2_0_so_0.c
/opt/lsb/bin/lsbcc -g -I../elfchk -I../tetj -DLSBVERSION=\"$LSBVERSION\" -DLSBLIBCHK_VERSION=\"3.1.1.20060614-1\" -Wall   -c -o libICE_so_6.o libICE_so_6.c
/opt/lsb/bin/lsbcc -g -I../elfchk -I../tetj -DLSBVERSION=\"$LSBVERSION\" -DLSBLIBCHK_VERSION=\"3.1.1.20060614-1\" -Wall   -c -o libjpeg_so_62.o libjpeg_so_62.c
/opt/lsb/bin/lsbcc -g -I../elfchk -I../tetj -DLSBVERSION=\"$LSBVERSION\" -DLSBLIBCHK_VERSION=\"3.1.1.20060614-1\" -Wall   -c -o libm_so_6.o libm_so_6.c
/opt/lsb/bin/lsbcc -g -I../elfchk -I../tetj -DLSBVERSION=\"$LSBVERSION\" -DLSBLIBCHK_VERSION=\"3.1.1.20060614-1\" -Wall   -c -o libm_so_6_1.o libm_so_6_1.c
/opt/lsb/bin/lsbcc -g -I../elfchk -I../tetj -DLSBVERSION=\"$LSBVERSION\" -DLSBLIBCHK_VERSION=\"3.1.1.20060614-1\" -Wall   -c -o libncurses_so_5.o libncurses_so_5.c
/opt/lsb/bin/lsbcc -g -I../elfchk -I../tetj -DLSBVERSION=\"$LSBVERSION\" -DLSBLIBCHK_VERSION=\"3.1.1.20060614-1\" -Wall   -c -o libpam_so_0.o libpam_so_0.c
/opt/lsb/bin/lsbcc -g -I../elfchk -I../tetj -DLSBVERSION=\"$LSBVERSION\" -DLSBLIBCHK_VERSION=\"3.1.1.20060614-1\" -Wall   -c -o libpango_1_0_so_0.o libpango_1_0_so_0.c
/opt/lsb/bin/lsbcc -g -I../elfchk -I../tetj -DLSBVERSION=\"$LSBVERSION\" -DLSBLIBCHK_VERSION=\"3.1.1.20060614-1\" -Wall   -c -o libpangoft2_1_0_so_0.o libpangoft2_1_0_so_0.c
/opt/lsb/bin/lsbcc -g -I../elfchk -I../tetj -DLSBVERSION=\"$LSBVERSION\" -DLSBLIBCHK_VERSION=\"3.1.1.20060614-1\" -Wall   -c -o libpangoxft_1_0_so_0.o libpangoxft_1_0_so_0.c
/opt/lsb/bin/lsbcc -g -I../elfchk -I../tetj -DLSBVERSION=\"$LSBVERSION\" -DLSBLIBCHK_VERSION=\"3.1.1.20060614-1\" -Wall   -c -o libpng12_so_0.o libpng12_so_0.c
/opt/lsb/bin/lsbcc -g -I../elfchk -I../tetj -DLSBVERSION=\"$LSBVERSION\" -DLSBLIBCHK_VERSION=\"3.1.1.20060614-1\" -Wall   -c -o libpthread_so_0.o libpthread_so_0.c
/opt/lsb/bin/lsbcc -g -I../elfchk -I../tetj -DLSBVERSION=\"$LSBVERSION\" -DLSBLIBCHK_VERSION=\"3.1.1.20060614-1\" -Wall   -c -o libqt_mt_so_3.o libqt_mt_so_3.c
/opt/lsb/bin/lsbcc -g -I../elfchk -I../tetj -DLSBVERSION=\"$LSBVERSION\" -DLSBLIBCHK_VERSION=\"3.1.1.20060614-1\" -Wall   -c -o libQtCore_so_4.o libQtCore_so_4.c
/opt/lsb/bin/lsbcc -g -I../elfchk -I../tetj -DLSBVERSION=\"$LSBVERSION\" -DLSBLIBCHK_VERSION=\"3.1.1.20060614-1\" -Wall   -c -o libQtGui_so_4.o libQtGui_so_4.c
/opt/lsb/bin/lsbcc -g -I../elfchk -I../tetj -DLSBVERSION=\"$LSBVERSION\" -DLSBLIBCHK_VERSION=\"3.1.1.20060614-1\" -Wall   -c -o libQtNetwork_so_4.o libQtNetwork_so_4.c
/opt/lsb/bin/lsbcc -g -I../elfchk -I../tetj -DLSBVERSION=\"$LSBVERSION\" -DLSBLIBCHK_VERSION=\"3.1.1.20060614-1\" -Wall   -c -o libQtOpenGL_so_4.o libQtOpenGL_so_4.c
/opt/lsb/bin/lsbcc -g -I../elfchk -I../tetj -DLSBVERSION=\"$LSBVERSION\" -DLSBLIBCHK_VERSION=\"3.1.1.20060614-1\" -Wall   -c -o libQtSql_so_4.o libQtSql_so_4.c
/opt/lsb/bin/lsbcc -g -I../elfchk -I../tetj -DLSBVERSION=\"$LSBVERSION\" -DLSBLIBCHK_VERSION=\"3.1.1.20060614-1\" -Wall   -c -o libQtSvg_so_4.o libQtSvg_so_4.c
/opt/lsb/bin/lsbcc -g -I../elfchk -I../tetj -DLSBVERSION=\"$LSBVERSION\" -DLSBLIBCHK_VERSION=\"3.1.1.20060614-1\" -Wall   -c -o libQtXml_so_4.o libQtXml_so_4.c
/opt/lsb/bin/lsbcc -g -I../elfchk -I../tetj -DLSBVERSION=\"$LSBVERSION\" -DLSBLIBCHK_VERSION=\"3.1.1.20060614-1\" -Wall   -c -o librt_so_1.o librt_so_1.c
/opt/lsb/bin/lsbcc -g -I../elfchk -I../tetj -DLSBVERSION=\"$LSBVERSION\" -DLSBLIBCHK_VERSION=\"3.1.1.20060614-1\" -Wall   -c -o libSM_so_6.o libSM_so_6.c
/opt/lsb/bin/lsbcc -g -I../elfchk -I../tetj -DLSBVERSION=\"$LSBVERSION\" -DLSBLIBCHK_VERSION=\"3.1.1.20060614-1\" -Wall   -c -o libstdcxx_so_6.o libstdcxx_so_6.c
/opt/lsb/bin/lsbcc -g -I../elfchk -I../tetj -DLSBVERSION=\"$LSBVERSION\" -DLSBLIBCHK_VERSION=\"3.1.1.20060614-1\" -Wall   -c -o libutil_so_1.o libutil_so_1.c
/opt/lsb/bin/lsbcc -g -I../elfchk -I../tetj -DLSBVERSION=\"$LSBVERSION\" -DLSBLIBCHK_VERSION=\"3.1.1.20060614-1\" -Wall   -c -o libX11_so_6.o libX11_so_6.c
/opt/lsb/bin/lsbcc -g -I../elfchk -I../tetj -DLSBVERSION=\"$LSBVERSION\" -DLSBLIBCHK_VERSION=\"3.1.1.20060614-1\" -Wall   -c -o libXext_so_6.o libXext_so_6.c
/opt/lsb/bin/lsbcc -g -I../elfchk -I../tetj -DLSBVERSION=\"$LSBVERSION\" -DLSBLIBCHK_VERSION=\"3.1.1.20060614-1\" -Wall   -c -o libXi_so_6.o libXi_so_6.c
/opt/lsb/bin/lsbcc -g -I../elfchk -I../tetj -DLSBVERSION=\"$LSBVERSION\" -DLSBLIBCHK_VERSION=\"3.1.1.20060614-1\" -Wall   -c -o libxml2_so_2.o libxml2_so_2.c
/opt/lsb/bin/lsbcc -g -I../elfchk -I../tetj -DLSBVERSION=\"$LSBVERSION\" -DLSBLIBCHK_VERSION=\"3.1.1.20060614-1\" -Wall   -c -o libXt_so_6.o libXt_so_6.c
/opt/lsb/bin/lsbcc -g -I../elfchk -I../tetj -DLSBVERSION=\"$LSBVERSION\" -DLSBLIBCHK_VERSION=\"3.1.1.20060614-1\" -Wall   -c -o libz_so_1.o libz_so_1.c
/opt/lsb/bin/lsbcc -g -I../elfchk -I../tetj -DLSBVERSION=\"$LSBVERSION\" -DLSBLIBCHK_VERSION=\"3.1.1.20060614-1\" -Wall -o libchk libchk.o libs.o classchk.o ld_lsb_ia64_so_3.o ld_lsb_ppc32_so_3.o ld_lsb_s390_so_3.o ld_lsb_so_3.o ld_lsb_ppc64_so_3.o ld_lsb_s390x_so_3.o ld_lsb_x86_64_so_3.o libatk_1_0_so_0.o libc_so_6.o libc_so_6_1.o libcrypt_so_1.o libdl_so_2.o libfontconfig_so_1.o libgcc_s_so_1.o libgdk_x11_2_0_so_0.o libgdk_pixbuf_2_0_so_0.o libgdk_pixbuf_xlib_2_0_so_0.o libGL_so_1.o libglib_2_0_so_0.o libgmodule_2_0_so_0.o libgobject_2_0_so_0.o libgthread_2_0_so_0.o libgtk_x11_2_0_so_0.o libICE_so_6.o libjpeg_so_62.o libm_so_6.o libm_so_6_1.o libncurses_so_5.o libpam_so_0.o libpango_1_0_so_0.o libpangoft2_1_0_so_0.o libpangoxft_1_0_so_0.o libpng12_so_0.o libpthread_so_0.o libqt_mt_so_3.o libQtCore_so_4.o libQtGui_so_4.o libQtNetwork_so_4.o libQtOpenGL_so_4.o libQtSql_so_4.o libQtSvg_so_4.o libQtXml_so_4.o librt_so_1.o libSM_so_6.o libstdcxx_so_6.o libutil_so_1.o libX11_so_6
 .o libXext_so_6.o libXi_so_6.o libxml2_so_2.o libXt_so_6.o libz_so_1.o  -L../elfchk -L ../tetj -lelfchk -ltetj -ldl
/opt/lsb/bin/lsbcc -g -I../elfchk -I../tetj -DLSBVERSION=\"$LSBVERSION\" -DLSBLIBCHK_VERSION=\"3.1.1.20060614-1\" -Wall -fno-builtin-acos -c -o dummy_link.o dummy_link.c
/opt/lsb/bin/lsbc++ -nostdlib -Wl,--dynamic-linker=`./lsb_linker` -L/opt/lsb/lib64 dummy_link.o -lGL -lICE -lSM -lX11 -lXi -lXext -lXt -lc -lrt -lcrypt -ldl -lgcc_s -lm -lncurses -lpam -lglib-2.0 -lgobject-2.0 -lgmodule-2.0 -lgthread-2.0 -latk-1.0 -lpango-1.0 -lpangoxft-1.0 -lpangoft2-1.0 -lgdk_pixbuf-2.0 -lgdk_pixbuf_xlib-2.0 -lgdk-x11-2.0 -lgtk-x11-2.0 -lQtCore -lQtGui -lQtNetwork -lQtXml -lQtOpenGL -lQtSql -lQtSvg -lfontconfig -lpng12 -ljpeg -lxml2 -lpthread -lutil -lz -lstdc++ -lqt-mt -o dummy_link
/usr/bin/ld: cannot find -lqt-mt
collect2: ld returned 1 exit status
make[2]: *** [dummy_link] Error 1
make[2]: Leaving directory `/home/autobuild/tmp/rpm-build/BUILD/lsb-libchk-3.1.1.20060614/tests/misc/libchk'
make[1]: *** [all] Error 2
make[1]: Leaving directory `/home/autobuild/tmp/rpm-build/BUILD/lsb-libchk-3.1.1.20060614'
error: Bad exit status from /var/tmp/rpm-tmp.74523 (%build)


RPM build errors:
    Bad exit status from /var/tmp/rpm-tmp.74523 (%build)
expect: spawn id exp3 not open
    while executing
"expect "exit 0""
send: spawn id exp3 not open
    while executing
"send "\n""
mv: cannot stat `/home/autobuild/tmp/rpm-build/RPMS/x86_64/lsb-libchk-3.1.1.20060614-1.x86_64.rpm': No such file or directory
make: *** [lsb-libchk-3.1.1.20060614-1.x86_64.rpm] Error 1




More information about the lsb-autobuild mailing list