[Lsb-autobuild] Build failure for t2c-desktop-tests on x86_64

lsb-autobuild at freestandards.org lsb-autobuild at freestandards.org
Wed Jan 30 08:09:32 PST 2008


This is an automated message generated when a build failure occurs

Linux lfdev-amd64 2.6.15-29-amd64-generic #1 SMP PREEMPT Mon Sep 24 17:19:55 UTC 2007 x86_64 x86_64 x86_64 GNU/Linux
Failed to make packages for t2c-desktop-tests
bzr export  t2c_tmp_dir /nethome/autobuild/tmp/LSBauto/t2c-harness
bzr export  lsb-test-desktop-t2c-3.2.0_tmp /nethome/autobuild/tmp/LSBauto/t2c-desktop-tests
spawn rpmbuild --sign --rcfile /usr/lib/rpm/rpmrc:./rpmrc --define=_sourcedir /nethome/autobuild/tmp/LSBauto/t2c-desktop-tests/desktop-t2c/package --define=_topdir /nethome/autobuild/tmp/rpm-build --define=_target_cpu x86_64 --define=name lsb-test-desktop-t2c --define=ver 3.2.0 --define=rel 1 -ba lsb-test-desktop-t2c.spec
Enter pass phrase: 
Pass phrase is good.
Executing(%prep): /bin/sh -e /var/tmp/rpm-tmp.32834
+ umask 022
+ cd /nethome/autobuild/tmp/rpm-build/BUILD
+ '[' '!' -x /opt/lsb/bin/lsbcc ']'
+ cd /nethome/autobuild/tmp/rpm-build/BUILD
+ rm -rf lsb-test-desktop-t2c-3.2.0
+ /usr/bin/gzip -dc /nethome/autobuild/tmp/LSBauto/t2c-desktop-tests/desktop-t2c/package/lsb-test-desktop-t2c-3.2.0.src.tgz
+ tar -xf -
+ STATUS=0
+ '[' 0 -ne 0 ']'
+ cd lsb-test-desktop-t2c-3.2.0
+ exit 0
Executing(%build): /bin/sh -e /var/tmp/rpm-tmp.32834
+ umask 022
+ cd /nethome/autobuild/tmp/rpm-build/BUILD
+ cd lsb-test-desktop-t2c-3.2.0
+ chmod -R +rx .
++ pwd
+ CUR_DIR=/nethome/autobuild/tmp/rpm-build/BUILD/lsb-test-desktop-t2c-3.2.0
+ export T2C_ROOT=/nethome/autobuild/tmp/rpm-build/BUILD/lsb-test-desktop-t2c-3.2.0/t2c_framework
+ T2C_ROOT=/nethome/autobuild/tmp/rpm-build/BUILD/lsb-test-desktop-t2c-3.2.0/t2c_framework
+ t2c_framework/t2c/build.sh
+ cd desktop-t2c
+ ./build_all.sh
TET_ROOT is /opt/lsb-tet3-lite
----------------------
Building atk-t2c
Language is C
Parsing file /nethome/autobuild/tmp/rpm-build/BUILD/lsb-test-desktop-t2c-3.2.0/desktop-t2c/atk-t2c/src/AtkAction/AtkAction.t2c
Parsing file /nethome/autobuild/tmp/rpm-build/BUILD/lsb-test-desktop-t2c-3.2.0/desktop-t2c/atk-t2c/src/AtkComponent/AtkComponent_bounds.t2c
Parsing file /nethome/autobuild/tmp/rpm-build/BUILD/lsb-test-desktop-t2c-3.2.0/desktop-t2c/atk-t2c/src/AtkComponent/AtkComponent_focus.t2c
Parsing file /nethome/autobuild/tmp/rpm-build/BUILD/lsb-test-desktop-t2c-3.2.0/desktop-t2c/atk-t2c/src/AtkDocument/AtkDocument.t2c
Parsing file /nethome/autobuild/tmp/rpm-build/BUILD/lsb-test-desktop-t2c-3.2.0/desktop-t2c/atk-t2c/src/AtkGObjectAccessible/AtkGObjectAccessible.t2c
Parsing file /nethome/autobuild/tmp/rpm-build/BUILD/lsb-test-desktop-t2c-3.2.0/desktop-t2c/atk-t2c/src/AtkHypertext&link/AtkHyperlink.t2c
Parsing file /nethome/autobuild/tmp/rpm-build/BUILD/lsb-test-desktop-t2c-3.2.0/desktop-t2c/atk-t2c/src/AtkHypertext&link/AtkHypertext.t2c
Parsing file /nethome/autobuild/tmp/rpm-build/BUILD/lsb-test-desktop-t2c-3.2.0/desktop-t2c/atk-t2c/src/AtkImage/AtkImage.t2c
Parsing file /nethome/autobuild/tmp/rpm-build/BUILD/lsb-test-desktop-t2c-3.2.0/desktop-t2c/atk-t2c/src/AtkNoOpObject&ObjectFactory/AtkNoOpObject.t2c
Parsing file /nethome/autobuild/tmp/rpm-build/BUILD/lsb-test-desktop-t2c-3.2.0/desktop-t2c/atk-t2c/src/AtkNoOpObject&ObjectFactory/AtkNoOpObjectFactory.t2c
Parsing file /nethome/autobuild/tmp/rpm-build/BUILD/lsb-test-desktop-t2c-3.2.0/desktop-t2c/atk-t2c/src/AtkObject/AtkImplementor.t2c
Parsing file /nethome/autobuild/tmp/rpm-build/BUILD/lsb-test-desktop-t2c-3.2.0/desktop-t2c/atk-t2c/src/AtkObject/AtkObject_get_set.t2c
Parsing file /nethome/autobuild/tmp/rpm-build/BUILD/lsb-test-desktop-t2c-3.2.0/desktop-t2c/atk-t2c/src/AtkObject/AtkObject_parent_child.t2c
Parsing file /nethome/autobuild/tmp/rpm-build/BUILD/lsb-test-desktop-t2c-3.2.0/desktop-t2c/atk-t2c/src/AtkObject/AtkObject_properties.t2c
Parsing file /nethome/autobuild/tmp/rpm-build/BUILD/lsb-test-desktop-t2c-3.2.0/desktop-t2c/atk-t2c/src/AtkObject/AtkObject_relation.t2c
Parsing file /nethome/autobuild/tmp/rpm-build/BUILD/lsb-test-desktop-t2c-3.2.0/desktop-t2c/atk-t2c/src/AtkObject/AtkObject_signals.t2c
Parsing file /nethome/autobuild/tmp/rpm-build/BUILD/lsb-test-desktop-t2c-3.2.0/desktop-t2c/atk-t2c/src/AtkObject/AtkRole.t2c
Parsing file /nethome/autobuild/tmp/rpm-build/BUILD/lsb-test-desktop-t2c-3.2.0/desktop-t2c/atk-t2c/src/AtkObjectFactory&AtkRegistry/AtkObjectFactory.t2c
Parsing file /nethome/autobuild/tmp/rpm-build/BUILD/lsb-test-desktop-t2c-3.2.0/desktop-t2c/atk-t2c/src/AtkObjectFactory&AtkRegistry/AtkRegistry.t2c
Parsing file /nethome/autobuild/tmp/rpm-build/BUILD/lsb-test-desktop-t2c-3.2.0/desktop-t2c/atk-t2c/src/AtkRelation/AtkRelation.t2c
Parsing file /nethome/autobuild/tmp/rpm-build/BUILD/lsb-test-desktop-t2c-3.2.0/desktop-t2c/atk-t2c/src/AtkRelationSet/AtkRelationSet.t2c
Parsing file /nethome/autobuild/tmp/rpm-build/BUILD/lsb-test-desktop-t2c-3.2.0/desktop-t2c/atk-t2c/src/AtkSelection/AtkSelection.t2c
Parsing file /nethome/autobuild/tmp/rpm-build/BUILD/lsb-test-desktop-t2c-3.2.0/desktop-t2c/atk-t2c/src/AtkState/AtkState.t2c
Parsing file /nethome/autobuild/tmp/rpm-build/BUILD/lsb-test-desktop-t2c-3.2.0/desktop-t2c/atk-t2c/src/AtkStateSet/AtkStateSet.t2c
Parsing file /nethome/autobuild/tmp/rpm-build/BUILD/lsb-test-desktop-t2c-3.2.0/desktop-t2c/atk-t2c/src/AtkStreamableContent/AtkStreamableContent.t2c
Parsing file /nethome/autobuild/tmp/rpm-build/BUILD/lsb-test-desktop-t2c-3.2.0/desktop-t2c/atk-t2c/src/AtkTable/AtkTable.t2c
Parsing file /nethome/autobuild/tmp/rpm-build/BUILD/lsb-test-desktop-t2c-3.2.0/desktop-t2c/atk-t2c/src/AtkText/AtkEditableText.t2c
Parsing file /nethome/autobuild/tmp/rpm-build/BUILD/lsb-test-desktop-t2c-3.2.0/desktop-t2c/atk-t2c/src/AtkText/AtkText_attributes.t2c
Parsing file /nethome/autobuild/tmp/rpm-build/BUILD/lsb-test-desktop-t2c-3.2.0/desktop-t2c/atk-t2c/src/AtkText/AtkText_attributes_self.t2c
Parsing file /nethome/autobuild/tmp/rpm-build/BUILD/lsb-test-desktop-t2c-3.2.0/desktop-t2c/atk-t2c/src/AtkText/AtkText_bounds.t2c
Parsing file /nethome/autobuild/tmp/rpm-build/BUILD/lsb-test-desktop-t2c-3.2.0/desktop-t2c/atk-t2c/src/AtkText/AtkText_get_text.t2c
Parsing file /nethome/autobuild/tmp/rpm-build/BUILD/lsb-test-desktop-t2c-3.2.0/desktop-t2c/atk-t2c/src/AtkText/AtkText_selection_caret.t2c
Parsing file /nethome/autobuild/tmp/rpm-build/BUILD/lsb-test-desktop-t2c-3.2.0/desktop-t2c/atk-t2c/src/AtkText/AtkText_signals.t2c
Parsing file /nethome/autobuild/tmp/rpm-build/BUILD/lsb-test-desktop-t2c-3.2.0/desktop-t2c/atk-t2c/src/AtkUtils/AtkUtils.t2c
Parsing file /nethome/autobuild/tmp/rpm-build/BUILD/lsb-test-desktop-t2c-3.2.0/desktop-t2c/atk-t2c/src/AtkValue/AtkValue.t2c
Parsing file /nethome/autobuild/tmp/rpm-build/BUILD/lsb-test-desktop-t2c-3.2.0/desktop-t2c/atk-t2c/src/GetType/GetType.t2c
make[1]: Entering directory `/nethome/autobuild/tmp/rpm-build/BUILD/lsb-test-desktop-t2c-3.2.0/desktop-t2c/atk-t2c/tests'
make -C AtkAction
make[2]: Entering directory `/nethome/autobuild/tmp/rpm-build/BUILD/lsb-test-desktop-t2c-3.2.0/desktop-t2c/atk-t2c/tests/AtkAction'
lsbcc -O2 -D"_POSIX_C_SOURCE=200112L" -std=c99 -I/nethome/autobuild/tmp/rpm-build/BUILD/lsb-test-desktop-t2c-3.2.0/t2c_framework/t2c/include -I/nethome/autobuild/tmp/rpm-build/BUILD/lsb-test-desktop-t2c-3.2.0/desktop-t2c/atk-t2c/include `pkg-config --cflags atk` -fno-stack-protector -I/opt/lsb-tet3-lite/inc/tet3  -o AtkAction AtkAction.c `pkg-config --libs atk` /opt/lsb-tet3-lite/lib/tet3/tcm.o /opt/lsb-tet3-lite/lib/tet3/libapi.a /nethome/autobuild/tmp/rpm-build/BUILD/lsb-test-desktop-t2c-3.2.0/t2c_framework/t2c/lib/t2c_util.a
chmod a+x AtkAction
make[2]: Leaving directory `/nethome/autobuild/tmp/rpm-build/BUILD/lsb-test-desktop-t2c-3.2.0/desktop-t2c/atk-t2c/tests/AtkAction'
make -C AtkComponent_bounds
make[2]: Entering directory `/nethome/autobuild/tmp/rpm-build/BUILD/lsb-test-desktop-t2c-3.2.0/desktop-t2c/atk-t2c/tests/AtkComponent_bounds'
lsbcc -O2 -D"_POSIX_C_SOURCE=200112L" -std=c99 -I/nethome/autobuild/tmp/rpm-build/BUILD/lsb-test-desktop-t2c-3.2.0/t2c_framework/t2c/include -I/nethome/autobuild/tmp/rpm-build/BUILD/lsb-test-desktop-t2c-3.2.0/desktop-t2c/atk-t2c/include `pkg-config --cflags atk` -fno-stack-protector -I/opt/lsb-tet3-lite/inc/tet3  -o AtkComponent_bounds AtkComponent_bounds.c `pkg-config --libs atk` /opt/lsb-tet3-lite/lib/tet3/tcm.o /opt/lsb-tet3-lite/lib/tet3/libapi.a /nethome/autobuild/tmp/rpm-build/BUILD/lsb-test-desktop-t2c-3.2.0/t2c_framework/t2c/lib/t2c_util.a
chmod a+x AtkComponent_bounds
make[2]: Leaving directory `/nethome/autobuild/tmp/rpm-build/BUILD/lsb-test-desktop-t2c-3.2.0/desktop-t2c/atk-t2c/tests/AtkComponent_bounds'
make -C AtkComponent_focus
make[2]: Entering directory `/nethome/autobuild/tmp/rpm-build/BUILD/lsb-test-desktop-t2c-3.2.0/desktop-t2c/atk-t2c/tests/AtkComponent_focus'
lsbcc -O2 -D"_POSIX_C_SOURCE=200112L" -std=c99 -I/nethome/autobuild/tmp/rpm-build/BUILD/lsb-test-desktop-t2c-3.2.0/t2c_framework/t2c/include -I/nethome/autobuild/tmp/rpm-build/BUILD/lsb-test-desktop-t2c-3.2.0/desktop-t2c/atk-t2c/include `pkg-config --cflags atk` -fno-stack-protector -I/opt/lsb-tet3-lite/inc/tet3  -o AtkComponent_focus AtkComponent_focus.c `pkg-config --libs atk` /opt/lsb-tet3-lite/lib/tet3/tcm.o /opt/lsb-tet3-lite/lib/tet3/libapi.a /nethome/autobuild/tmp/rpm-build/BUILD/lsb-test-desktop-t2c-3.2.0/t2c_framework/t2c/lib/t2c_util.a
chmod a+x AtkComponent_focus
make[2]: Leaving directory `/nethome/autobuild/tmp/rpm-build/BUILD/lsb-test-desktop-t2c-3.2.0/desktop-t2c/atk-t2c/tests/AtkComponent_focus'
make -C AtkDocument
make[2]: Entering directory `/nethome/autobuild/tmp/rpm-build/BUILD/lsb-test-desktop-t2c-3.2.0/desktop-t2c/atk-t2c/tests/AtkDocument'
lsbcc -O2 -D"_POSIX_C_SOURCE=200112L" -std=c99 -I/nethome/autobuild/tmp/rpm-build/BUILD/lsb-test-desktop-t2c-3.2.0/t2c_framework/t2c/include -I/nethome/autobuild/tmp/rpm-build/BUILD/lsb-test-desktop-t2c-3.2.0/desktop-t2c/atk-t2c/include `pkg-config --cflags atk` -fno-stack-protector -I/opt/lsb-tet3-lite/inc/tet3  -o AtkDocument AtkDocument.c `pkg-config --libs atk` /opt/lsb-tet3-lite/lib/tet3/tcm.o /opt/lsb-tet3-lite/lib/tet3/libapi.a /nethome/autobuild/tmp/rpm-build/BUILD/lsb-test-desktop-t2c-3.2.0/t2c_framework/t2c/lib/t2c_util.a
chmod a+x AtkDocument
make[2]: Leaving directory `/nethome/autobuild/tmp/rpm-build/BUILD/lsb-test-desktop-t2c-3.2.0/desktop-t2c/atk-t2c/tests/AtkDocument'
make -C AtkEditableText
make[2]: Entering directory `/nethome/autobuild/tmp/rpm-build/BUILD/lsb-test-desktop-t2c-3.2.0/desktop-t2c/atk-t2c/tests/AtkEditableText'
lsbcc -O2 -D"_POSIX_C_SOURCE=200112L" -std=c99 -I/nethome/autobuild/tmp/rpm-build/BUILD/lsb-test-desktop-t2c-3.2.0/t2c_framework/t2c/include -I/nethome/autobuild/tmp/rpm-build/BUILD/lsb-test-desktop-t2c-3.2.0/desktop-t2c/atk-t2c/include `pkg-config --cflags atk` -fno-stack-protector -I/opt/lsb-tet3-lite/inc/tet3  -o AtkEditableText AtkEditableText.c `pkg-config --libs atk` /opt/lsb-tet3-lite/lib/tet3/tcm.o /opt/lsb-tet3-lite/lib/tet3/libapi.a /nethome/autobuild/tmp/rpm-build/BUILD/lsb-test-desktop-t2c-3.2.0/t2c_framework/t2c/lib/t2c_util.a
shell-init: error retrieving current directory: getcwd: cannot access parent directories: No such file or directory
shell-init: error retrieving current directory: getcwd: cannot access parent directories: No such file or directory
cc: AtkEditableText.c: No such file or directory
cc: /nethome/autobuild/tmp/rpm-build/BUILD/lsb-test-desktop-t2c-3.2.0/t2c_framework/t2c/lib/t2c_util.a: No such file or directory
make[2]: *** [AtkEditableText] Error 1
make[2]: Leaving directory `/nethome/autobuild/tmp/rpm-build/BUILD/lsb-test-desktop-t2c-3.2.0/desktop-t2c/atk-t2c/tests/AtkEditableText'
make[1]: *** [AtkEditableText] Error 2
make[1]: Leaving directory `/nethome/autobuild/tmp/rpm-build/BUILD/lsb-test-desktop-t2c-3.2.0/desktop-t2c/atk-t2c/tests'
Failed to build tests for atk-t2c, aborting...
error: Bad exit status from /var/tmp/rpm-tmp.32834 (%build)


RPM build errors:
    Bad exit status from /var/tmp/rpm-tmp.32834 (%build)
expect: spawn id exp3 not open
    while executing
"expect "exit 0""
send: spawn id exp3 not open
    while executing
"send "\n""
mv: cannot stat `/nethome/autobuild/tmp/rpm-build/SRPMS/lsb-test-desktop-t2c-3.2.0-1.src.rpm': No such file or directory
make: *** [lsb-test-desktop-t2c-3.2.0-1.x86_64.rpm] Error 1



More information about the lsb-autobuild mailing list