[Lsb-messages] Build failure for xts5-test on ia32

lsb-autobuild at freestandards.org lsb-autobuild at freestandards.org
Fri Oct 3 02:08:22 PDT 2008


This is an automated message generated when a build failure occurs

Linux lfdev-ia32 2.6.24-19-generic #1 SMP Fri Jul 11 23:41:49 UTC 2008 i686 i686 i386 GNU/Linux
Failed to make packages for xts5-test
bzr export lsb-test-xts5-5.1.5.tar.gz /nethome/autobuild/tmp/LSBauto/xts5-test
tar -czf vsw4-evi-tests.tar.gz -C /nethome/autobuild/tmp/LSBauto/vsw4-test xtest/tset/EVI xtest/src/bin/mc
spawn rpmbuild --sign --rcfile /usr/lib/rpm/rpmrc:./rpmrc --define=_sourcedir /nethome/autobuild/tmp/LSBauto/xts5-test/package --define=_topdir /nethome/autobuild/tmp/rpm-build --define=_target_cpu i486 --define=rel 14 --define=ver 5.1.5 --define=LSBRelease 4 -ba lsb-test-xts5.spec
Enter pass phrase: 
Pass phrase is good.
Executing(%prep): /bin/sh -e /var/tmp/rpm-tmp.22626
+ umask 022
+ cd /nethome/autobuild/tmp/rpm-build/BUILD
+ cd /nethome/autobuild/tmp/rpm-build/BUILD
+ rm -rf lsb-test-xts5-5.1.5
+ /bin/mkdir -p lsb-test-xts5-5.1.5
+ cd lsb-test-xts5-5.1.5
+ /usr/bin/gzip -dc /nethome/autobuild/tmp/LSBauto/xts5-test/package/xts5-5.1.5.tar.gz
+ tar -xf -
+ STATUS=0
+ '[' 0 -ne 0 ']'
+ tar xzf /nethome/autobuild/tmp/LSBauto/xts5-test/package/lsb-test-xts5-5.1.5.tar.gz -C ../
+ tar xzf /nethome/autobuild/tmp/LSBauto/xts5-test/package/vsw4-evi-tests.tar.gz -C xts5
+ echo 'Patch #0 (xts5-5.1.5-lsb-generic.patch):'
Patch #0 (xts5-5.1.5-lsb-generic.patch):
+ patch -p0 -b --suffix .lsb-xts5-generic -s
+ echo 'Patch #1 (xts5-5.1.5-lsb-Xt.patch):'
Patch #1 (xts5-5.1.5-lsb-Xt.patch):
+ patch -p0 -b --suffix .lsb-xts5-Xt -s
+ echo 'Patch #2 (xts5-5.1.5-lsb-Xlib.patch):'
Patch #2 (xts5-5.1.5-lsb-Xlib.patch):
+ patch -p0 -b --suffix .lsb-xts5-Xlib -s
+ echo 'Patch #3 (xts5-5.1.5-lsb-XI.patch):'
Patch #3 (xts5-5.1.5-lsb-XI.patch):
+ patch -p0 -b --suffix .lsb-xts5-XI -s
+ echo 'Patch #4 (xts5-5.1.5-bug-1589.patch):'
Patch #4 (xts5-5.1.5-bug-1589.patch):
+ patch -p0 -b --suffix .lsb-1589 -s
+ echo 'Patch #6 (xts5-5.1.5-lsbcc.patch):'
Patch #6 (xts5-5.1.5-lsbcc.patch):
+ patch -p0 -b --suffix .lsbcc -s
+ echo 'Patch #8 (xts5-5.1.5-bug-1906.patch):'
Patch #8 (xts5-5.1.5-bug-1906.patch):
+ patch -p0 -b --suffix .bug-1906 -s
+ echo 'Patch #9 (xts5-5.1.5-bug-1937.patch):'
Patch #9 (xts5-5.1.5-bug-1937.patch):
+ patch -p0 -b --suffix .bug-1937 -s
+ echo 'Patch #10 (xts5-5.1.5-bug-1991.patch):'
Patch #10 (xts5-5.1.5-bug-1991.patch):
+ patch -p0 -b --suffix .bug-1991 -s
+ echo 'Patch #11 (xts5-5.1.5-redefine-NULL.patch):'
Patch #11 (xts5-5.1.5-redefine-NULL.patch):
+ patch -p0 -b --suffix .NULL -s
+ echo 'Patch #12 (xts5-5.1.5-lsbcc2.patch):'
Patch #12 (xts5-5.1.5-lsbcc2.patch):
+ patch -p0 -b --suffix .lsbcc2 -s
+ echo 'Patch #16 (xts5-5.1.5-lsbcc6.patch):'
Patch #16 (xts5-5.1.5-lsbcc6.patch):
+ patch -p0 -b --suffix .lsbcc6 -s
+ find xts5/src -name '*.lsbcc*'
+ xargs chmod 0660
+ sed -i 's|index|xindex|g' xts5/tset/Xlib17/kycdtkysym/kycdtkysym.m
+ sed -i 's|index|xindex|g' xts5/tset/Xlib17/lkpkysym/lkpkysym.m
+ exit 0
Executing(%build): /bin/sh -e /var/tmp/rpm-tmp.45066
+ umask 022
+ cd /nethome/autobuild/tmp/rpm-build/BUILD
+ cd lsb-test-xts5-5.1.5
+ LDSO_VERSION=3
+ LDSO=/lib/ld-lsb.so.3
+ for test in vgtvslinf vqryextnsn vqryvrsn
+ echo /tset/EVI/vgtvslinf/Test
+ for test in vgtvslinf vqryextnsn vqryvrsn
+ echo /tset/EVI/vqryextnsn/Test
+ for test in vgtvslinf vqryextnsn vqryvrsn
+ echo /tset/EVI/vqryvrsn/Test
+ sed -i 's|\t:include:/scenarios/XIproto_scen|\t:include:/scenarios/XIproto_scen\n\t:include:/scenarios/EVI_scen|' xts5/tet_scen
+ mv xts5/xtest/tset/EVI xts5/tset
+ cd xts5/xtest/src/bin/mc
+ make
make[1]: Entering directory `/nethome/autobuild/tmp/rpm-build/BUILD/lsb-test-xts5-5.1.5/xts5/xtest/src/bin/mc'
cc    -c -o main.o main.c
cc    -c -o sections.o sections.c
cc    -c -o files.o files.c
cc    -c -o shortname.o shortname.c
cc    -c -o error.o error.c
cc    -c -o gccomps.o gccomps.c
cc    -c -o set.o set.c
cc    -c -o expand.o expand.c
cc    -c -o code.o code.c
cc    -c -o make.o make.c
cc    -c -o ma.o ma.c
cc    -c -o cond.o cond.c
cc    -c -o mas.o mas.c
cc  -o mc main.o sections.o files.o shortname.o error.o gccomps.o set.o expand.o code.o make.o ma.o cond.o mas.o  
make[1]: Leaving directory `/nethome/autobuild/tmp/rpm-build/BUILD/lsb-test-xts5-5.1.5/xts5/xtest/src/bin/mc'
+ cp mc ../../../../bin/mc-vsw4
+ cd -
/nethome/autobuild/tmp/rpm-build/BUILD/lsb-test-xts5-5.1.5
+ cd xts5/xtest
+ install -d lib/mc
+ cp -ar src/bin/mc/tmpl/maheader.mc src/bin/mc/tmpl/Makefile src/bin/mc/tmpl/mcextern.mc src/bin/mc/tmpl/mcinclude.mc src/bin/mc/tmpl/mcxpext.mc src/bin/mc/tmpl/mcxpinc.mc src/bin/mc/tmpl/mmlib.mc src/bin/mc/tmpl/mmlink.mc src/bin/mc/tmpl/mmmisc.mc src/bin/mc/tmpl/mmmlink.mc src/bin/mc/tmpl/mmmsa.mc src/bin/mc/tmpl/mmpgen.mc src/bin/mc/tmpl/mmsa.mc src/bin/mc/tmpl/mmxpinit.mc src/bin/mc/tmpl/mmxplib.mc lib/mc
+ cd -
/nethome/autobuild/tmp/rpm-build/BUILD/lsb-test-xts5-5.1.5
+ cd xts5/tset/EVI
+ for test in vgtvslinf vqryextnsn vqryvrsn
+ cd vgtvslinf
+ TET_ROOT=../../..
+ ../../../bin/mc-vsw4 -o Test.c vgtvslinf.m
+ cd ..
+ for test in vgtvslinf vqryextnsn vqryvrsn
+ cd vqryextnsn
+ TET_ROOT=../../..
+ ../../../bin/mc-vsw4 -o Test.c vqryextnsn.m
+ cd ..
+ for test in vgtvslinf vqryextnsn vqryvrsn
+ cd vqryvrsn
+ TET_ROOT=../../..
+ ../../../bin/mc-vsw4 -o Test.c vqryvrsn.m
+ cd ..
+ cd ../../..
+ CC='lsbcc -DX11_t -DTRANS_CLIENT -DUNIXCONN'
+ sed -i 's|SYSINC=-I/usr/include/X11 -I/usr/X11R6/include/X11|SYSINC=-I/nethome/autobuild/tmp/rpm-build/BUILD/lsb-test-xts5-5.1.5/xts5/src/lib -I/nethome/autobuild/tmp/rpm-build/BUILD/lsb-test-xts5-5.1.5/xts5/src/lib/X11|' configs/tetbuild.cfg.skel
+ CC='lsbcc -DX11_t -DTRANS_CLIENT -DUNIXCONN'
+ ./build.sh
make[1]: Entering directory `/nethome/autobuild/tmp/rpm-build/BUILD/lsb-test-xts5-5.1.5/xts5'
chmod ugo+x bin/wbuild
VSW5 INSTALLATION LOG

Fri Oct  3 09:11:50 UTC 2008
Linux lfdev-ia32 2.6.24-19-generic #1 SMP Fri Jul 11 23:41:49 UTC 2008 i686 i686 i386 GNU/Linux
uid=2009(autobuild) gid=2000(ldapusers) groups=2000(ldapusers),2012(lsbcommit)

Building libxtest
make[2]: Entering directory `/nethome/autobuild/tmp/rpm-build/BUILD/lsb-test-xts5-5.1.5/xts5/src/lib'
lsbcc -DX11_t -DTRANS_CLIENT -DUNIXCONN -c -DXT_X_RELEASE=6  -O -I. -I/opt/lsb-tet3-lite/inc/tet3 -I/nethome/autobuild/tmp/rpm-build/BUILD/lsb-test-xts5-5.1.5/xts5/src/lib -I/nethome/autobuild/tmp/rpm-build/BUILD/lsb-test-xts5-5.1.5/xts5/src/lib/X11 -I/nethome/autobuild/tmp/rpm-build/BUILD/lsb-test-xts5-5.1.5/xts5/include -DXTESTEXTENSION -DINPUTEXTENSION startup.c
lsbcc -DX11_t -DTRANS_CLIENT -DUNIXCONN -c -DXT_X_RELEASE=6  -O -I. -I/opt/lsb-tet3-lite/inc/tet3 -I/nethome/autobuild/tmp/rpm-build/BUILD/lsb-test-xts5-5.1.5/xts5/src/lib -I/nethome/autobuild/tmp/rpm-build/BUILD/lsb-test-xts5-5.1.5/xts5/src/lib/X11 -I/nethome/autobuild/tmp/rpm-build/BUILD/lsb-test-xts5-5.1.5/xts5/include -DXTESTEXTENSION -DINPUTEXTENSION ex_startup.c
lsbcc -DX11_t -DTRANS_CLIENT -DUNIXCONN -c -DXT_X_RELEASE=6  -O -I. -I/opt/lsb-tet3-lite/inc/tet3 -I/nethome/autobuild/tmp/rpm-build/BUILD/lsb-test-xts5-5.1.5/xts5/src/lib -I/nethome/autobuild/tmp/rpm-build/BUILD/lsb-test-xts5-5.1.5/xts5/src/lib/X11 -I/nethome/autobuild/tmp/rpm-build/BUILD/lsb-test-xts5-5.1.5/xts5/include -DXTESTEXTENSION -DINPUTEXTENSION lookupname.c
lsbcc -DX11_t -DTRANS_CLIENT -DUNIXCONN -c -DXT_X_RELEASE=6  -O -I. -I/opt/lsb-tet3-lite/inc/tet3 -I/nethome/autobuild/tmp/rpm-build/BUILD/lsb-test-xts5-5.1.5/xts5/src/lib -I/nethome/autobuild/tmp/rpm-build/BUILD/lsb-test-xts5-5.1.5/xts5/src/lib/X11 -I/nethome/autobuild/tmp/rpm-build/BUILD/lsb-test-xts5-5.1.5/xts5/include -DXTESTEXTENSION -DINPUTEXTENSION err.c
lsbcc -DX11_t -DTRANS_CLIENT -DUNIXCONN -c -DXT_X_RELEASE=6  -O -I. -I/opt/lsb-tet3-lite/inc/tet3 -I/nethome/autobuild/tmp/rpm-build/BUILD/lsb-test-xts5-5.1.5/xts5/src/lib -I/nethome/autobuild/tmp/rpm-build/BUILD/lsb-test-xts5-5.1.5/xts5/src/lib/X11 -I/nethome/autobuild/tmp/rpm-build/BUILD/lsb-test-xts5-5.1.5/xts5/include -DXTESTEXTENSION -DINPUTEXTENSION getevent.c
lsbcc -DX11_t -DTRANS_CLIENT -DUNIXCONN -c -DXT_X_RELEASE=6  -O -I. -I/opt/lsb-tet3-lite/inc/tet3 -I/nethome/autobuild/tmp/rpm-build/BUILD/lsb-test-xts5-5.1.5/xts5/src/lib -I/nethome/autobuild/tmp/rpm-build/BUILD/lsb-test-xts5-5.1.5/xts5/src/lib/X11 -I/nethome/autobuild/tmp/rpm-build/BUILD/lsb-test-xts5-5.1.5/xts5/include -DXTESTEXTENSION -DINPUTEXTENSION stackorder.c
lsbcc -DX11_t -DTRANS_CLIENT -DUNIXCONN -c -DXT_X_RELEASE=6  -O -I. -I/opt/lsb-tet3-lite/inc/tet3 -I/nethome/autobuild/tmp/rpm-build/BUILD/lsb-test-xts5-5.1.5/xts5/src/lib -I/nethome/autobuild/tmp/rpm-build/BUILD/lsb-test-xts5-5.1.5/xts5/src/lib/X11 -I/nethome/autobuild/tmp/rpm-build/BUILD/lsb-test-xts5-5.1.5/xts5/include -DXTESTEXTENSION -DINPUTEXTENSION report.c
lsbcc -DX11_t -DTRANS_CLIENT -DUNIXCONN -c -DXT_X_RELEASE=6  -O -I. -I/opt/lsb-tet3-lite/inc/tet3 -I/nethome/autobuild/tmp/rpm-build/BUILD/lsb-test-xts5-5.1.5/xts5/src/lib -I/nethome/autobuild/tmp/rpm-build/BUILD/lsb-test-xts5-5.1.5/xts5/src/lib/X11 -I/nethome/autobuild/tmp/rpm-build/BUILD/lsb-test-xts5-5.1.5/xts5/include -DXTESTEXTENSION -DINPUTEXTENSION iponlywin.c
lsbcc -DX11_t -DTRANS_CLIENT -DUNIXCONN -c -DXT_X_RELEASE=6  -O -I. -I/opt/lsb-tet3-lite/inc/tet3 -I/nethome/autobuild/tmp/rpm-build/BUILD/lsb-test-xts5-5.1.5/xts5/src/lib -I/nethome/autobuild/tmp/rpm-build/BUILD/lsb-test-xts5-5.1.5/xts5/src/lib/X11 -I/nethome/autobuild/tmp/rpm-build/BUILD/lsb-test-xts5-5.1.5/xts5/include -DXTESTEXTENSION -DINPUTEXTENSION badwin.c
lsbcc -DX11_t -DTRANS_CLIENT -DUNIXCONN -c -DXT_X_RELEASE=6  -O -I. -I/opt/lsb-tet3-lite/inc/tet3 -I/nethome/autobuild/tmp/rpm-build/BUILD/lsb-test-xts5-5.1.5/xts5/src/lib -I/nethome/autobuild/tmp/rpm-build/BUILD/lsb-test-xts5-5.1.5/xts5/src/lib/X11 -I/nethome/autobuild/tmp/rpm-build/BUILD/lsb-test-xts5-5.1.5/xts5/include -DXTESTEXTENSION -DINPUTEXTENSION startcall.c
lsbcc -DX11_t -DTRANS_CLIENT -DUNIXCONN -c -DXT_X_RELEASE=6  -O -I. -I/opt/lsb-tet3-lite/inc/tet3 -I/nethome/autobuild/tmp/rpm-build/BUILD/lsb-test-xts5-5.1.5/xts5/src/lib -I/nethome/autobuild/tmp/rpm-build/BUILD/lsb-test-xts5-5.1.5/xts5/src/lib/X11 -I/nethome/autobuild/tmp/rpm-build/BUILD/lsb-test-xts5-5.1.5/xts5/include -DXTESTEXTENSION -DINPUTEXTENSION makewin.c
lsbcc -DX11_t -DTRANS_CLIENT -DUNIXCONN -c -DXT_X_RELEASE=6  -O -I. -I/opt/lsb-tet3-lite/inc/tet3 -I/nethome/autobuild/tmp/rpm-build/BUILD/lsb-test-xts5-5.1.5/xts5/src/lib -I/nethome/autobuild/tmp/rpm-build/BUILD/lsb-test-xts5-5.1.5/xts5/src/lib/X11 -I/nethome/autobuild/tmp/rpm-build/BUILD/lsb-test-xts5-5.1.5/xts5/include -DXTESTEXTENSION -DINPUTEXTENSION checkevent.c
lsbcc -DX11_t -DTRANS_CLIENT -DUNIXCONN -c -DXT_X_RELEASE=6  -O -I. -I/opt/lsb-tet3-lite/inc/tet3 -I/nethome/autobuild/tmp/rpm-build/BUILD/lsb-test-xts5-5.1.5/xts5/src/lib -I/nethome/autobuild/tmp/rpm-build/BUILD/lsb-test-xts5-5.1.5/xts5/src/lib/X11 -I/nethome/autobuild/tmp/rpm-build/BUILD/lsb-test-xts5-5.1.5/xts5/include -DXTESTEXTENSION -DINPUTEXTENSION nextvclass.c
lsbcc -DX11_t -DTRANS_CLIENT -DUNIXCONN -c -DXT_X_RELEASE=6  -O -I. -I/opt/lsb-tet3-lite/inc/tet3 -I/nethome/autobuild/tmp/rpm-build/BUILD/lsb-test-xts5-5.1.5/xts5/src/lib -I/nethome/autobuild/tmp/rpm-build/BUILD/lsb-test-xts5-5.1.5/xts5/src/lib/X11 -I/nethome/autobuild/tmp/rpm-build/BUILD/lsb-test-xts5-5.1.5/xts5/include -DXTESTEXTENSION -DINPUTEXTENSION badgc.c
lsbcc -DX11_t -DTRANS_CLIENT -DUNIXCONN -c -DXT_X_RELEASE=6  -O -I. -I/opt/lsb-tet3-lite/inc/tet3 -I/nethome/autobuild/tmp/rpm-build/BUILD/lsb-test-xts5-5.1.5/xts5/src/lib -I/nethome/autobuild/tmp/rpm-build/BUILD/lsb-test-xts5-5.1.5/xts5/src/lib/X11 -I/nethome/autobuild/tmp/rpm-build/BUILD/lsb-test-xts5-5.1.5/xts5/include -DXTESTEXTENSION -DINPUTEXTENSION badpixm.c
lsbcc -DX11_t -DTRANS_CLIENT -DUNIXCONN -c -DXT_X_RELEASE=6  -O -I. -I/opt/lsb-tet3-lite/inc/tet3 -I/nethome/autobuild/tmp/rpm-build/BUILD/lsb-test-xts5-5.1.5/xts5/src/lib -I/nethome/autobuild/tmp/rpm-build/BUILD/lsb-test-xts5-5.1.5/xts5/src/lib/X11 -I/nethome/autobuild/tmp/rpm-build/BUILD/lsb-test-xts5-5.1.5/xts5/include -DXTESTEXTENSION -DINPUTEXTENSION badfont.c
lsbcc -DX11_t -DTRANS_CLIENT -DUNIXCONN -c -DXT_X_RELEASE=6  -O -I. -I/opt/lsb-tet3-lite/inc/tet3 -I/nethome/autobuild/tmp/rpm-build/BUILD/lsb-test-xts5-5.1.5/xts5/src/lib -I/nethome/autobuild/tmp/rpm-build/BUILD/lsb-test-xts5-5.1.5/xts5/src/lib/X11 -I/nethome/autobuild/tmp/rpm-build/BUILD/lsb-test-xts5-5.1.5/xts5/include -DXTESTEXTENSION -DINPUTEXTENSION badvis.c
lsbcc -DX11_t -DTRANS_CLIENT -DUNIXCONN -c -DXT_X_RELEASE=6  -O -I. -I/opt/lsb-tet3-lite/inc/tet3 -I/nethome/autobuild/tmp/rpm-build/BUILD/lsb-test-xts5-5.1.5/xts5/src/lib -I/nethome/autobuild/tmp/rpm-build/BUILD/lsb-test-xts5-5.1.5/xts5/src/lib/X11 -I/nethome/autobuild/tmp/rpm-build/BUILD/lsb-test-xts5-5.1.5/xts5/include -DXTESTEXTENSION -DINPUTEXTENSION linkstart.c
lsbcc -DX11_t -DTRANS_CLIENT -DUNIXCONN -c -DXT_X_RELEASE=6  -O -I. -I/opt/lsb-tet3-lite/inc/tet3 -I/nethome/autobuild/tmp/rpm-build/BUILD/lsb-test-xts5-5.1.5/xts5/src/lib -I/nethome/autobuild/tmp/rpm-build/BUILD/lsb-test-xts5-5.1.5/xts5/src/lib/X11 -I/nethome/autobuild/tmp/rpm-build/BUILD/lsb-test-xts5-5.1.5/xts5/include -DXTESTEXTENSION -DINPUTEXTENSION issuppvis.c
lsbcc -DX11_t -DTRANS_CLIENT -DUNIXCONN -c -DXT_X_RELEASE=6  -O -I. -I/opt/lsb-tet3-lite/inc/tet3 -I/nethome/autobuild/tmp/rpm-build/BUILD/lsb-test-xts5-5.1.5/xts5/src/lib -I/nethome/autobuild/tmp/rpm-build/BUILD/lsb-test-xts5-5.1.5/xts5/src/lib/X11 -I/nethome/autobuild/tmp/rpm-build/BUILD/lsb-test-xts5-5.1.5/xts5/include -DXTESTEXTENSION -DINPUTEXTENSION checkarea.c
lsbcc -DX11_t -DTRANS_CLIENT -DUNIXCONN -c -DXT_X_RELEASE=6  -O -I. -I/opt/lsb-tet3-lite/inc/tet3 -I/nethome/autobuild/tmp/rpm-build/BUILD/lsb-test-xts5-5.1.5/xts5/src/lib -I/nethome/autobuild/tmp/rpm-build/BUILD/lsb-test-xts5-5.1.5/xts5/src/lib/X11 -I/nethome/autobuild/tmp/rpm-build/BUILD/lsb-test-xts5-5.1.5/xts5/include -DXTESTEXTENSION -DINPUTEXTENSION getsize.c
lsbcc -DX11_t -DTRANS_CLIENT -DUNIXCONN -c -DXT_X_RELEASE=6  -O -I. -I/opt/lsb-tet3-lite/inc/tet3 -I/nethome/autobuild/tmp/rpm-build/BUILD/lsb-test-xts5-5.1.5/xts5/src/lib -I/nethome/autobuild/tmp/rpm-build/BUILD/lsb-test-xts5-5.1.5/xts5/src/lib/X11 -I/nethome/autobuild/tmp/rpm-build/BUILD/lsb-test-xts5-5.1.5/xts5/include -DXTESTEXTENSION -DINPUTEXTENSION pattern.c
lsbcc -DX11_t -DTRANS_CLIENT -DUNIXCONN -c -DXT_X_RELEASE=6  -O -I. -I/opt/lsb-tet3-lite/inc/tet3 -I/nethome/autobuild/tmp/rpm-build/BUILD/lsb-test-xts5-5.1.5/xts5/src/lib -I/nethome/autobuild/tmp/rpm-build/BUILD/lsb-test-xts5-5.1.5/xts5/src/lib/X11 -I/nethome/autobuild/tmp/rpm-build/BUILD/lsb-test-xts5-5.1.5/xts5/include -DXTESTEXTENSION -DINPUTEXTENSION crechild.c
lsbcc -DX11_t -DTRANS_CLIENT -DUNIXCONN -c -DXT_X_RELEASE=6  -O -I. -I/opt/lsb-tet3-lite/inc/tet3 -I/nethome/autobuild/tmp/rpm-build/BUILD/lsb-test-xts5-5.1.5/xts5/src/lib -I/nethome/autobuild/tmp/rpm-build/BUILD/lsb-test-xts5-5.1.5/xts5/src/lib/X11 -I/nethome/autobuild/tmp/rpm-build/BUILD/lsb-test-xts5-5.1.5/xts5/include -DXTESTEXTENSION -DINPUTEXTENSION checktile.c
lsbcc -DX11_t -DTRANS_CLIENT -DUNIXCONN -c -DXT_X_RELEASE=6  -O -I. -I/opt/lsb-tet3-lite/inc/tet3 -I/nethome/autobuild/tmp/rpm-build/BUILD/lsb-test-xts5-5.1.5/xts5/src/lib -I/nethome/autobuild/tmp/rpm-build/BUILD/lsb-test-xts5-5.1.5/xts5/src/lib/X11 -I/nethome/autobuild/tmp/rpm-build/BUILD/lsb-test-xts5-5.1.5/xts5/include -DXTESTEXTENSION -DINPUTEXTENSION makepixm.c
lsbcc -DX11_t -DTRANS_CLIENT -DUNIXCONN -c -DXT_X_RELEASE=6  -O -I. -I/opt/lsb-tet3-lite/inc/tet3 -I/nethome/autobuild/tmp/rpm-build/BUILD/lsb-test-xts5-5.1.5/xts5/src/lib -I/nethome/autobuild/tmp/rpm-build/BUILD/lsb-test-xts5-5.1.5/xts5/src/lib/X11 -I/nethome/autobuild/tmp/rpm-build/BUILD/lsb-test-xts5-5.1.5/xts5/include -DXTESTEXTENSION -DINPUTEXTENSION nextvinf.c
lsbcc -DX11_t -DTRANS_CLIENT -DUNIXCONN -c -DXT_X_RELEASE=6  -O -I. -I/opt/lsb-tet3-lite/inc/tet3 -I/nethome/autobuild/tmp/rpm-build/BUILD/lsb-test-xts5-5.1.5/xts5/src/lib -I/nethome/autobuild/tmp/rpm-build/BUILD/lsb-test-xts5-5.1.5/xts5/src/lib/X11 -I/nethome/autobuild/tmp/rpm-build/BUILD/lsb-test-xts5-5.1.5/xts5/include -DXTESTEXTENSION -DINPUTEXTENSION makegc.c
lsbcc -DX11_t -DTRANS_CLIENT -DUNIXCONN -c -DXT_X_RELEASE=6  -O -I. -I/opt/lsb-tet3-lite/inc/tet3 -I/nethome/autobuild/tmp/rpm-build/BUILD/lsb-test-xts5-5.1.5/xts5/src/lib -I/nethome/autobuild/tmp/rpm-build/BUILD/lsb-test-xts5-5.1.5/xts5/src/lib/X11 -I/nethome/autobuild/tmp/rpm-build/BUILD/lsb-test-xts5-5.1.5/xts5/include -DXTESTEXTENSION -DINPUTEXTENSION dumpimage.c
lsbcc -DX11_t -DTRANS_CLIENT -DUNIXCONN -c -DXT_X_RELEASE=6  -O -I. -I/opt/lsb-tet3-lite/inc/tet3 -I/nethome/autobuild/tmp/rpm-build/BUILD/lsb-test-xts5-5.1.5/xts5/src/lib -I/nethome/autobuild/tmp/rpm-build/BUILD/lsb-test-xts5-5.1.5/xts5/src/lib/X11 -I/nethome/autobuild/tmp/rpm-build/BUILD/lsb-test-xts5-5.1.5/xts5/include -DXTESTEXTENSION -DINPUTEXTENSION verimage.c
lsbcc -DX11_t -DTRANS_CLIENT -DUNIXCONN -c -DXT_X_RELEASE=6  -O -I. -I/opt/lsb-tet3-lite/inc/tet3 -I/nethome/autobuild/tmp/rpm-build/BUILD/lsb-test-xts5-5.1.5/xts5/src/lib -I/nethome/autobuild/tmp/rpm-build/BUILD/lsb-test-xts5-5.1.5/xts5/src/lib/X11 -I/nethome/autobuild/tmp/rpm-build/BUILD/lsb-test-xts5-5.1.5/xts5/include -DXTESTEXTENSION -DINPUTEXTENSION dset.c
lsbcc -DX11_t -DTRANS_CLIENT -DUNIXCONN -c -DXT_X_RELEASE=6  -O -I. -I/opt/lsb-tet3-lite/inc/tet3 -I/nethome/autobuild/tmp/rpm-build/BUILD/lsb-test-xts5-5.1.5/xts5/src/lib -I/nethome/autobuild/tmp/rpm-build/BUILD/lsb-test-xts5-5.1.5/xts5/src/lib/X11 -I/nethome/autobuild/tmp/rpm-build/BUILD/lsb-test-xts5-5.1.5/xts5/include -DXTESTEXTENSION -DINPUTEXTENSION delete.c
lsbcc -DX11_t -DTRANS_CLIENT -DUNIXCONN -c -DXT_X_RELEASE=6  -O -I. -I/opt/lsb-tet3-lite/inc/tet3 -I/nethome/autobuild/tmp/rpm-build/BUILD/lsb-test-xts5-5.1.5/xts5/src/lib -I/nethome/autobuild/tmp/rpm-build/BUILD/lsb-test-xts5-5.1.5/xts5/src/lib/X11 -I/nethome/autobuild/tmp/rpm-build/BUILD/lsb-test-xts5-5.1.5/xts5/include -DXTESTEXTENSION -DINPUTEXTENSION rpt.c
lsbcc -DX11_t -DTRANS_CLIENT -DUNIXCONN -c -DXT_X_RELEASE=6  -O -I. -I/opt/lsb-tet3-lite/inc/tet3 -I/nethome/autobuild/tmp/rpm-build/BUILD/lsb-test-xts5-5.1.5/xts5/src/lib -I/nethome/autobuild/tmp/rpm-build/BUILD/lsb-test-xts5-5.1.5/xts5/src/lib/X11 -I/nethome/autobuild/tmp/rpm-build/BUILD/lsb-test-xts5-5.1.5/xts5/include -DXTESTEXTENSION -DINPUTEXTENSION savimage.c
lsbcc -DX11_t -DTRANS_CLIENT -DUNIXCONN -c -DXT_X_RELEASE=6  -O -I. -I/opt/lsb-tet3-lite/inc/tet3 -I/nethome/autobuild/tmp/rpm-build/BUILD/lsb-test-xts5-5.1.5/xts5/src/lib -I/nethome/autobuild/tmp/rpm-build/BUILD/lsb-test-xts5-5.1.5/xts5/src/lib/X11 -I/nethome/autobuild/tmp/rpm-build/BUILD/lsb-test-xts5-5.1.5/xts5/include -DXTESTEXTENSION -DINPUTEXTENSION checkpixel.c
lsbcc -DX11_t -DTRANS_CLIENT -DUNIXCONN -c -DXT_X_RELEASE=6  -O -I. -I/opt/lsb-tet3-lite/inc/tet3 -I/nethome/autobuild/tmp/rpm-build/BUILD/lsb-test-xts5-5.1.5/xts5/src/lib -I/nethome/autobuild/tmp/rpm-build/BUILD/lsb-test-xts5-5.1.5/xts5/src/lib/X11 -I/nethome/autobuild/tmp/rpm-build/BUILD/lsb-test-xts5-5.1.5/xts5/include -DXTESTEXTENSION -DINPUTEXTENSION notmember.c
lsbcc -DX11_t -DTRANS_CLIENT -DUNIXCONN -c -DXT_X_RELEASE=6  -O -I. -I/opt/lsb-tet3-lite/inc/tet3 -I/nethome/autobuild/tmp/rpm-build/BUILD/lsb-test-xts5-5.1.5/xts5/src/lib -I/nethome/autobuild/tmp/rpm-build/BUILD/lsb-test-xts5-5.1.5/xts5/src/lib/X11 -I/nethome/autobuild/tmp/rpm-build/BUILD/lsb-test-xts5-5.1.5/xts5/include -DXTESTEXTENSION -DINPUTEXTENSION setline.c
lsbcc -DX11_t -DTRANS_CLIENT -DUNIXCONN -c -DXT_X_RELEASE=6  -O -I. -I/opt/lsb-tet3-lite/inc/tet3 -I/nethome/autobuild/tmp/rpm-build/BUILD/lsb-test-xts5-5.1.5/xts5/src/lib -I/nethome/autobuild/tmp/rpm-build/BUILD/lsb-test-xts5-5.1.5/xts5/src/lib/X11 -I/nethome/autobuild/tmp/rpm-build/BUILD/lsb-test-xts5-5.1.5/xts5/include -DXTESTEXTENSION -DINPUTEXTENSION checkgc.c
lsbcc -DX11_t -DTRANS_CLIENT -DUNIXCONN -c -DXT_X_RELEASE=6  -O -I. -I/opt/lsb-tet3-lite/inc/tet3 -I/nethome/autobuild/tmp/rpm-build/BUILD/lsb-test-xts5-5.1.5/xts5/src/lib -I/nethome/autobuild/tmp/rpm-build/BUILD/lsb-test-xts5-5.1.5/xts5/src/lib/X11 -I/nethome/autobuild/tmp/rpm-build/BUILD/lsb-test-xts5-5.1.5/xts5/include -DXTESTEXTENSION -DINPUTEXTENSION gcflush.c
lsbcc -DX11_t -DTRANS_CLIENT -DUNIXCONN -c -DXT_X_RELEASE=6  -O -I. -I/opt/lsb-tet3-lite/inc/tet3 -I/nethome/autobuild/tmp/rpm-build/BUILD/lsb-test-xts5-5.1.5/xts5/src/lib -I/nethome/autobuild/tmp/rpm-build/BUILD/lsb-test-xts5-5.1.5/xts5/src/lib/X11 -I/nethome/autobuild/tmp/rpm-build/BUILD/lsb-test-xts5-5.1.5/xts5/include -DXTESTEXTENSION -DINPUTEXTENSION tpstartup.c
lsbcc -DX11_t -DTRANS_CLIENT -DUNIXCONN -c -DXT_X_RELEASE=6  -O -I. -I/opt/lsb-tet3-lite/inc/tet3 -I/nethome/autobuild/tmp/rpm-build/BUILD/lsb-test-xts5-5.1.5/xts5/src/lib -I/nethome/autobuild/tmp/rpm-build/BUILD/lsb-test-xts5-5.1.5/xts5/src/lib/X11 -I/nethome/autobuild/tmp/rpm-build/BUILD/lsb-test-xts5-5.1.5/xts5/include -DXTESTEXTENSION -DINPUTEXTENSION nondpth1pix.c
lsbcc -DX11_t -DTRANS_CLIENT -DUNIXCONN -c -DXT_X_RELEASE=6  -O -I. -I/opt/lsb-tet3-lite/inc/tet3 -I/nethome/autobuild/tmp/rpm-build/BUILD/lsb-test-xts5-5.1.5/xts5/src/lib -I/nethome/autobuild/tmp/rpm-build/BUILD/lsb-test-xts5-5.1.5/xts5/src/lib/X11 -I/nethome/autobuild/tmp/rpm-build/BUILD/lsb-test-xts5-5.1.5/xts5/include -DXTESTEXTENSION -DINPUTEXTENSION gcinclude.c
lsbcc -DX11_t -DTRANS_CLIENT -DUNIXCONN -c -DXT_X_RELEASE=6  -O -I. -I/opt/lsb-tet3-lite/inc/tet3 -I/nethome/autobuild/tmp/rpm-build/BUILD/lsb-test-xts5-5.1.5/xts5/src/lib -I/nethome/autobuild/tmp/rpm-build/BUILD/lsb-test-xts5-5.1.5/xts5/src/lib/X11 -I/nethome/autobuild/tmp/rpm-build/BUILD/lsb-test-xts5-5.1.5/xts5/include -DXTESTEXTENSION -DINPUTEXTENSION regid.c
lsbcc -DX11_t -DTRANS_CLIENT -DUNIXCONN -c -DXT_X_RELEASE=6  -O -I. -I/opt/lsb-tet3-lite/inc/tet3 -I/nethome/autobuild/tmp/rpm-build/BUILD/lsb-test-xts5-5.1.5/xts5/src/lib -I/nethome/autobuild/tmp/rpm-build/BUILD/lsb-test-xts5-5.1.5/xts5/src/lib/X11 -I/nethome/autobuild/tmp/rpm-build/BUILD/lsb-test-xts5-5.1.5/xts5/include -DXTESTEXTENSION -DINPUTEXTENSION openfonts.c
lsbcc -DX11_t -DTRANS_CLIENT -DUNIXCONN -c -DXT_X_RELEASE=6  -O -I. -I/opt/lsb-tet3-lite/inc/tet3 -I/nethome/autobuild/tmp/rpm-build/BUILD/lsb-test-xts5-5.1.5/xts5/src/lib -I/nethome/autobuild/tmp/rpm-build/BUILD/lsb-test-xts5-5.1.5/xts5/src/lib/X11 -I/nethome/autobuild/tmp/rpm-build/BUILD/lsb-test-xts5-5.1.5/xts5/include -DXTESTEXTENSION -DINPUTEXTENSION checkfont.c
lsbcc -DX11_t -DTRANS_CLIENT -DUNIXCONN -c -DXT_X_RELEASE=6  -O -I. -I/opt/lsb-tet3-lite/inc/tet3 -I/nethome/autobuild/tmp/rpm-build/BUILD/lsb-test-xts5-5.1.5/xts5/src/lib -I/nethome/autobuild/tmp/rpm-build/BUILD/lsb-test-xts5-5.1.5/xts5/src/lib/X11 -I/nethome/autobuild/tmp/rpm-build/BUILD/lsb-test-xts5-5.1.5/xts5/include -DXTESTEXTENSION -DINPUTEXTENSION badcmap.c
lsbcc -DX11_t -DTRANS_CLIENT -DUNIXCONN -c -DXT_X_RELEASE=6  -O -I. -I/opt/lsb-tet3-lite/inc/tet3 -I/nethome/autobuild/tmp/rpm-build/BUILD/lsb-test-xts5-5.1.5/xts5/src/lib -I/nethome/autobuild/tmp/rpm-build/BUILD/lsb-test-xts5-5.1.5/xts5/src/lib/X11 -I/nethome/autobuild/tmp/rpm-build/BUILD/lsb-test-xts5-5.1.5/xts5/include -DXTESTEXTENSION -DINPUTEXTENSION makecolmap.c
lsbcc -DX11_t -DTRANS_CLIENT -DUNIXCONN -c -DXT_X_RELEASE=6  -O -I. -I/opt/lsb-tet3-lite/inc/tet3 -I/nethome/autobuild/tmp/rpm-build/BUILD/lsb-test-xts5-5.1.5/xts5/src/lib -I/nethome/autobuild/tmp/rpm-build/BUILD/lsb-test-xts5-5.1.5/xts5/src/lib/X11 -I/nethome/autobuild/tmp/rpm-build/BUILD/lsb-test-xts5-5.1.5/xts5/include -DXTESTEXTENSION -DINPUTEXTENSION makecur.c
lsbcc -DX11_t -DTRANS_CLIENT -DUNIXCONN -c -DXT_X_RELEASE=6  -O -I. -I/opt/lsb-tet3-lite/inc/tet3 -I/nethome/autobuild/tmp/rpm-build/BUILD/lsb-test-xts5-5.1.5/xts5/src/lib -I/nethome/autobuild/tmp/rpm-build/BUILD/lsb-test-xts5-5.1.5/xts5/src/lib/X11 -I/nethome/autobuild/tmp/rpm-build/BUILD/lsb-test-xts5-5.1.5/xts5/include -DXTESTEXTENSION -DINPUTEXTENSION makeimg.c
lsbcc -DX11_t -DTRANS_CLIENT -DUNIXCONN -c -DXT_X_RELEASE=6  -O -I. -I/opt/lsb-tet3-lite/inc/tet3 -I/nethome/autobuild/tmp/rpm-build/BUILD/lsb-test-xts5-5.1.5/xts5/src/lib -I/nethome/autobuild/tmp/rpm-build/BUILD/lsb-test-xts5-5.1.5/xts5/src/lib/X11 -I/nethome/autobuild/tmp/rpm-build/BUILD/lsb-test-xts5-5.1.5/xts5/include -DXTESTEXTENSION -DINPUTEXTENSION checkimg.c
lsbcc -DX11_t -DTRANS_CLIENT -DUNIXCONN -c -DXT_X_RELEASE=6  -O -I. -I/opt/lsb-tet3-lite/inc/tet3 -I/nethome/autobuild/tmp/rpm-build/BUILD/lsb-test-xts5-5.1.5/xts5/src/lib -I/nethome/autobuild/tmp/rpm-build/BUILD/lsb-test-xts5-5.1.5/xts5/src/lib/X11 -I/nethome/autobuild/tmp/rpm-build/BUILD/lsb-test-xts5-5.1.5/xts5/include -DXTESTEXTENSION -DINPUTEXTENSION opendisp.c
lsbcc -DX11_t -DTRANS_CLIENT -DUNIXCONN -c -DXT_X_RELEASE=6  -O -I. -I/opt/lsb-tet3-lite/inc/tet3 -I/nethome/autobuild/tmp/rpm-build/BUILD/lsb-test-xts5-5.1.5/xts5/src/lib -I/nethome/autobuild/tmp/rpm-build/BUILD/lsb-test-xts5-5.1.5/xts5/src/lib/X11 -I/nethome/autobuild/tmp/rpm-build/BUILD/lsb-test-xts5-5.1.5/xts5/include -DXTESTEXTENSION -DINPUTEXTENSION bitcount.c
lsbcc -DX11_t -DTRANS_CLIENT -DUNIXCONN -c -DXT_X_RELEASE=6  -O -I. -I/opt/lsb-tet3-lite/inc/tet3 -I/nethome/autobuild/tmp/rpm-build/BUILD/lsb-test-xts5-5.1.5/xts5/src/lib -I/nethome/autobuild/tmp/rpm-build/BUILD/lsb-test-xts5-5.1.5/xts5/src/lib/X11 -I/nethome/autobuild/tmp/rpm-build/BUILD/lsb-test-xts5-5.1.5/xts5/include -DXTESTEXTENSION -DINPUTEXTENSION config.c
lsbcc -DX11_t -DTRANS_CLIENT -DUNIXCONN -c -DXT_X_RELEASE=6  -O -I. -I/opt/lsb-tet3-lite/inc/tet3 -I/nethome/autobuild/tmp/rpm-build/BUILD/lsb-test-xts5-5.1.5/xts5/src/lib -I/nethome/autobuild/tmp/rpm-build/BUILD/lsb-test-xts5-5.1.5/xts5/src/lib/X11 -I/nethome/autobuild/tmp/rpm-build/BUILD/lsb-test-xts5-5.1.5/xts5/include -DXTESTEXTENSION -DINPUTEXTENSION makewin2.c
lsbcc -DX11_t -DTRANS_CLIENT -DUNIXCONN -c -DXT_X_RELEASE=6  -O -I. -I/opt/lsb-tet3-lite/inc/tet3 -I/nethome/autobuild/tmp/rpm-build/BUILD/lsb-test-xts5-5.1.5/xts5/src/lib -I/nethome/autobuild/tmp/rpm-build/BUILD/lsb-test-xts5-5.1.5/xts5/src/lib/X11 -I/nethome/autobuild/tmp/rpm-build/BUILD/lsb-test-xts5-5.1.5/xts5/include -DXTESTEXTENSION -DINPUTEXTENSION block.c
lsbcc -DX11_t -DTRANS_CLIENT -DUNIXCONN -c -DXT_X_RELEASE=6  -O -I. -I/opt/lsb-tet3-lite/inc/tet3 -I/nethome/autobuild/tmp/rpm-build/BUILD/lsb-test-xts5-5.1.5/xts5/src/lib -I/nethome/autobuild/tmp/rpm-build/BUILD/lsb-test-xts5-5.1.5/xts5/src/lib/X11 -I/nethome/autobuild/tmp/rpm-build/BUILD/lsb-test-xts5-5.1.5/xts5/include -DXTESTEXTENSION -DINPUTEXTENSION winh.c
lsbcc -DX11_t -DTRANS_CLIENT -DUNIXCONN -c -DXT_X_RELEASE=6  -O -I. -I/opt/lsb-tet3-lite/inc/tet3 -I/nethome/autobuild/tmp/rpm-build/BUILD/lsb-test-xts5-5.1.5/xts5/src/lib -I/nethome/autobuild/tmp/rpm-build/BUILD/lsb-test-xts5-5.1.5/xts5/src/lib/X11 -I/nethome/autobuild/tmp/rpm-build/BUILD/lsb-test-xts5-5.1.5/xts5/include -DXTESTEXTENSION -DINPUTEXTENSION pointer.c
lsbcc -DX11_t -DTRANS_CLIENT -DUNIXCONN -c -DXT_X_RELEASE=6  -O -I. -I/opt/lsb-tet3-lite/inc/tet3 -I/nethome/autobuild/tmp/rpm-build/BUILD/lsb-test-xts5-5.1.5/xts5/src/lib -I/nethome/autobuild/tmp/rpm-build/BUILD/lsb-test-xts5-5.1.5/xts5/src/lib/X11 -I/nethome/autobuild/tmp/rpm-build/BUILD/lsb-test-xts5-5.1.5/xts5/include -DXTESTEXTENSION -DINPUTEXTENSION events.c
lsbcc -DX11_t -DTRANS_CLIENT -DUNIXCONN -c -DXT_X_RELEASE=6  -O -I. -I/opt/lsb-tet3-lite/inc/tet3 -I/nethome/autobuild/tmp/rpm-build/BUILD/lsb-test-xts5-5.1.5/xts5/src/lib -I/nethome/autobuild/tmp/rpm-build/BUILD/lsb-test-xts5-5.1.5/xts5/src/lib/X11 -I/nethome/autobuild/tmp/rpm-build/BUILD/lsb-test-xts5-5.1.5/xts5/include -DXTESTEXTENSION -DINPUTEXTENSION gettime.c
lsbcc -DX11_t -DTRANS_CLIENT -DUNIXCONN -c -DXT_X_RELEASE=6  -O -I. -I/opt/lsb-tet3-lite/inc/tet3 -I/nethome/autobuild/tmp/rpm-build/BUILD/lsb-test-xts5-5.1.5/xts5/src/lib -I/nethome/autobuild/tmp/rpm-build/BUILD/lsb-test-xts5-5.1.5/xts5/src/lib/X11 -I/nethome/autobuild/tmp/rpm-build/BUILD/lsb-test-xts5-5.1.5/xts5/include -DXTESTEXTENSION -DINPUTEXTENSION maxsize.c
lsbcc -DX11_t -DTRANS_CLIENT -DUNIXCONN -c -DXT_X_RELEASE=6  -O -I. -I/opt/lsb-tet3-lite/inc/tet3 -I/nethome/autobuild/tmp/rpm-build/BUILD/lsb-test-xts5-5.1.5/xts5/src/lib -I/nethome/autobuild/tmp/rpm-build/BUILD/lsb-test-xts5-5.1.5/xts5/src/lib/X11 -I/nethome/autobuild/tmp/rpm-build/BUILD/lsb-test-xts5-5.1.5/xts5/include -DXTESTEXTENSION -DINPUTEXTENSION buildtree.c
lsbcc -DX11_t -DTRANS_CLIENT -DUNIXCONN -c -DXT_X_RELEASE=6  -O -I. -I/opt/lsb-tet3-lite/inc/tet3 -I/nethome/autobuild/tmp/rpm-build/BUILD/lsb-test-xts5-5.1.5/xts5/src/lib -I/nethome/autobuild/tmp/rpm-build/BUILD/lsb-test-xts5-5.1.5/xts5/src/lib/X11 -I/nethome/autobuild/tmp/rpm-build/BUILD/lsb-test-xts5-5.1.5/xts5/include -DXTESTEXTENSION -DINPUTEXTENSION exposechk.c
lsbcc -DX11_t -DTRANS_CLIENT -DUNIXCONN -c -DXT_X_RELEASE=6  -O -I. -I/opt/lsb-tet3-lite/inc/tet3 -I/nethome/autobuild/tmp/rpm-build/BUILD/lsb-test-xts5-5.1.5/xts5/src/lib -I/nethome/autobuild/tmp/rpm-build/BUILD/lsb-test-xts5-5.1.5/xts5/src/lib/X11 -I/nethome/autobuild/tmp/rpm-build/BUILD/lsb-test-xts5-5.1.5/xts5/include -DXTESTEXTENSION -DINPUTEXTENSION settimeout.c
lsbcc -DX11_t -DTRANS_CLIENT -DUNIXCONN -c -DXT_X_RELEASE=6  -O -I. -I/opt/lsb-tet3-lite/inc/tet3 -I/nethome/autobuild/tmp/rpm-build/BUILD/lsb-test-xts5-5.1.5/xts5/src/lib -I/nethome/autobuild/tmp/rpm-build/BUILD/lsb-test-xts5-5.1.5/xts5/src/lib/X11 -I/nethome/autobuild/tmp/rpm-build/BUILD/lsb-test-xts5-5.1.5/xts5/include -DXTESTEXTENSION -DINPUTEXTENSION makeregion.c
lsbcc -DX11_t -DTRANS_CLIENT -DUNIXCONN -c -DXT_X_RELEASE=6  -O -I. -I/opt/lsb-tet3-lite/inc/tet3 -I/nethome/autobuild/tmp/rpm-build/BUILD/lsb-test-xts5-5.1.5/xts5/src/lib -I/nethome/autobuild/tmp/rpm-build/BUILD/lsb-test-xts5-5.1.5/xts5/src/lib/X11 -I/nethome/autobuild/tmp/rpm-build/BUILD/lsb-test-xts5-5.1.5/xts5/include -DXTESTEXTENSION -DINPUTEXTENSION xthost.c
lsbcc -DX11_t -DTRANS_CLIENT -DUNIXCONN -c -DXT_X_RELEASE=6  -O -I. -I/opt/lsb-tet3-lite/inc/tet3 -I/nethome/autobuild/tmp/rpm-build/BUILD/lsb-test-xts5-5.1.5/xts5/src/lib -I/nethome/autobuild/tmp/rpm-build/BUILD/lsb-test-xts5-5.1.5/xts5/src/lib/X11 -I/nethome/autobuild/tmp/rpm-build/BUILD/lsb-test-xts5-5.1.5/xts5/include -DXTESTEXTENSION -DINPUTEXTENSION pfcount.c
lsbcc -DX11_t -DTRANS_CLIENT -DUNIXCONN -c -DXT_X_RELEASE=6  -O -I. -I/opt/lsb-tet3-lite/inc/tet3 -I/nethome/autobuild/tmp/rpm-build/BUILD/lsb-test-xts5-5.1.5/xts5/src/lib -I/nethome/autobuild/tmp/rpm-build/BUILD/lsb-test-xts5-5.1.5/xts5/src/lib/X11 -I/nethome/autobuild/tmp/rpm-build/BUILD/lsb-test-xts5-5.1.5/xts5/include -DXTESTEXTENSION -DINPUTEXTENSION XTestExt.c
lsbcc -DX11_t -DTRANS_CLIENT -DUNIXCONN -c -DXT_X_RELEASE=6  -O -I. -I/opt/lsb-tet3-lite/inc/tet3 -I/nethome/autobuild/tmp/rpm-build/BUILD/lsb-test-xts5-5.1.5/xts5/src/lib -I/nethome/autobuild/tmp/rpm-build/BUILD/lsb-test-xts5-5.1.5/xts5/src/lib/X11 -I/nethome/autobuild/tmp/rpm-build/BUILD/lsb-test-xts5-5.1.5/xts5/include -DXTESTEXTENSION -DINPUTEXTENSION devcntl.c
lsbcc -DX11_t -DTRANS_CLIENT -DUNIXCONN -c -DXT_X_RELEASE=6  -O -I. -I/opt/lsb-tet3-lite/inc/tet3 -I/nethome/autobuild/tmp/rpm-build/BUILD/lsb-test-xts5-5.1.5/xts5/src/lib -I/nethome/autobuild/tmp/rpm-build/BUILD/lsb-test-xts5-5.1.5/xts5/src/lib/X11 -I/nethome/autobuild/tmp/rpm-build/BUILD/lsb-test-xts5-5.1.5/xts5/include -DXTESTEXTENSION -DINPUTEXTENSION extenavail.c
lsbcc -DX11_t -DTRANS_CLIENT -DUNIXCONN -c -DXT_X_RELEASE=6  -O -I. -I/opt/lsb-tet3-lite/inc/tet3 -I/nethome/autobuild/tmp/rpm-build/BUILD/lsb-test-xts5-5.1.5/xts5/src/lib -I/nethome/autobuild/tmp/rpm-build/BUILD/lsb-test-xts5-5.1.5/xts5/src/lib/X11 -I/nethome/autobuild/tmp/rpm-build/BUILD/lsb-test-xts5-5.1.5/xts5/include -DXTESTEXTENSION -DINPUTEXTENSION environ.c
lsbcc -DX11_t -DTRANS_CLIENT -DUNIXCONN -c -DXT_X_RELEASE=6  -O -I. -I/opt/lsb-tet3-lite/inc/tet3 -I/nethome/autobuild/tmp/rpm-build/BUILD/lsb-test-xts5-5.1.5/xts5/src/lib -I/nethome/autobuild/tmp/rpm-build/BUILD/lsb-test-xts5-5.1.5/xts5/src/lib/X11 -I/nethome/autobuild/tmp/rpm-build/BUILD/lsb-test-xts5-5.1.5/xts5/include -DXTESTEXTENSION -DINPUTEXTENSION cursor.c
lsbcc -DX11_t -DTRANS_CLIENT -DUNIXCONN -c -DXT_X_RELEASE=6  -O -I. -I/opt/lsb-tet3-lite/inc/tet3 -I/nethome/autobuild/tmp/rpm-build/BUILD/lsb-test-xts5-5.1.5/xts5/src/lib -I/nethome/autobuild/tmp/rpm-build/BUILD/lsb-test-xts5-5.1.5/xts5/src/lib/X11 -I/nethome/autobuild/tmp/rpm-build/BUILD/lsb-test-xts5-5.1.5/xts5/include -DXTESTEXTENSION -DINPUTEXTENSION XInput.c
: ranlib libxtest.a
lsbcc -DX11_t -DTRANS_CLIENT -DUNIXCONN -c -DXT_X_RELEASE=6  -O -I. -I/opt/lsb-tet3-lite/inc/tet3 -I/nethome/autobuild/tmp/rpm-build/BUILD/lsb-test-xts5-5.1.5/xts5/src/lib -I/nethome/autobuild/tmp/rpm-build/BUILD/lsb-test-xts5-5.1.5/xts5/src/lib/X11 -I/nethome/autobuild/tmp/rpm-build/BUILD/lsb-test-xts5-5.1.5/xts5/include -DXTESTEXTENSION -DINPUTEXTENSION XExtIntsub.c
lsbcc -DX11_t -DTRANS_CLIENT -DUNIXCONN -c -DXT_X_RELEASE=6  -O -I. -I/opt/lsb-tet3-lite/inc/tet3 -I/nethome/autobuild/tmp/rpm-build/BUILD/lsb-test-xts5-5.1.5/xts5/src/lib -I/nethome/autobuild/tmp/rpm-build/BUILD/lsb-test-xts5-5.1.5/xts5/src/lib/X11 -I/nethome/autobuild/tmp/rpm-build/BUILD/lsb-test-xts5-5.1.5/xts5/include -DXTESTEXTENSION -DINPUTEXTENSION ConnDis.c
ConnDis.c: In function ‘GetAuthorization’:
ConnDis.c:1044: warning: passing argument 8 of ‘XauGetBestAuthByAddr’ discards qualifiers from pointer target type
lsbcc -DX11_t -DTRANS_CLIENT -DUNIXCONN -c -DXT_X_RELEASE=6  -O -I. -I/opt/lsb-tet3-lite/inc/tet3 -I/nethome/autobuild/tmp/rpm-build/BUILD/lsb-test-xts5-5.1.5/xts5/src/lib -I/nethome/autobuild/tmp/rpm-build/BUILD/lsb-test-xts5-5.1.5/xts5/src/lib/X11 -I/nethome/autobuild/tmp/rpm-build/BUILD/lsb-test-xts5-5.1.5/xts5/include -DXTESTEXTENSION -DINPUTEXTENSION CrGC.c
lsbcc -DX11_t -DTRANS_CLIENT -DUNIXCONN -c -DXT_X_RELEASE=6  -O -I. -I/opt/lsb-tet3-lite/inc/tet3 -I/nethome/autobuild/tmp/rpm-build/BUILD/lsb-test-xts5-5.1.5/xts5/src/lib -I/nethome/autobuild/tmp/rpm-build/BUILD/lsb-test-xts5-5.1.5/xts5/src/lib/X11 -I/nethome/autobuild/tmp/rpm-build/BUILD/lsb-test-xts5-5.1.5/xts5/include -DXTESTEXTENSION -DINPUTEXTENSION XlibIntsub.c
lsbcc -DX11_t -DTRANS_CLIENT -DUNIXCONN -c -DXT_X_RELEASE=6  -O -I. -I/opt/lsb-tet3-lite/inc/tet3 -I/nethome/autobuild/tmp/rpm-build/BUILD/lsb-test-xts5-5.1.5/xts5/src/lib -I/nethome/autobuild/tmp/rpm-build/BUILD/lsb-test-xts5-5.1.5/xts5/src/lib/X11 -I/nethome/autobuild/tmp/rpm-build/BUILD/lsb-test-xts5-5.1.5/xts5/include -DXTESTEXTENSION -DINPUTEXTENSION globals.c
lsbcc -DX11_t -DTRANS_CLIENT -DUNIXCONN -c -DXT_X_RELEASE=6  -O -I. -I/opt/lsb-tet3-lite/inc/tet3 -I/nethome/autobuild/tmp/rpm-build/BUILD/lsb-test-xts5-5.1.5/xts5/src/lib -I/nethome/autobuild/tmp/rpm-build/BUILD/lsb-test-xts5-5.1.5/xts5/src/lib/X11 -I/nethome/autobuild/tmp/rpm-build/BUILD/lsb-test-xts5-5.1.5/xts5/include -DXTESTEXTENSION -DINPUTEXTENSION x11trans.c
In file included from Xtranssock.c:98,
                 from x11trans.c:80:
/opt/lsb/include/netinet/tcp.h:67: error: duplicate member ‘res2’
/opt/lsb/include/netinet/tcp.h:68: error: duplicate member ‘res2’
/opt/lsb/include/netinet/tcp.h:69: error: duplicate member ‘res2’
/opt/lsb/include/netinet/tcp.h:75: error: duplicate member ‘res2’
/opt/lsb/include/netinet/tcp.h:76: error: duplicate member ‘res2’
/opt/lsb/include/netinet/tcp.h:77: error: duplicate member ‘res2’
In file included from x11trans.c:80:
Xtranssock.c: In function ‘UnixHostReallyLocal’:
Xtranssock.c:1885: warning: ‘gethostbyname’ is deprecated (declared at /opt/lsb/include/netdb.h:144)
Xtranssock.c:1906: warning: ‘gethostbyname’ is deprecated (declared at /opt/lsb/include/netdb.h:144)
make[2]: [x11trans.o] Error 1 (ignored)
lsbcc -DX11_t -DTRANS_CLIENT -DUNIXCONN -c -DXT_X_RELEASE=6  -O -I. -I/opt/lsb-tet3-lite/inc/tet3 -I/nethome/autobuild/tmp/rpm-build/BUILD/lsb-test-xts5-5.1.5/xts5/src/lib -I/nethome/autobuild/tmp/rpm-build/BUILD/lsb-test-xts5-5.1.5/xts5/src/lib/X11 -I/nethome/autobuild/tmp/rpm-build/BUILD/lsb-test-xts5-5.1.5/xts5/include -DXTESTEXTENSION -DINPUTEXTENSION extutil.c
ar: x11trans.o: No such file or directory
make[2]: [libxtestlsbcc.a] Error 1 (ignored)
: ranlib libxtestlsbcc.a
lsbcc -DX11_t -DTRANS_CLIENT -DUNIXCONN -c -DXT_X_RELEASE=6  -O -I. -I/opt/lsb-tet3-lite/inc/tet3 -I/nethome/autobuild/tmp/rpm-build/BUILD/lsb-test-xts5-5.1.5/xts5/src/lib -I/nethome/autobuild/tmp/rpm-build/BUILD/lsb-test-xts5-5.1.5/xts5/src/lib/X11 -I/nethome/autobuild/tmp/rpm-build/BUILD/lsb-test-xts5-5.1.5/xts5/include -DXTESTEXTENSION -DINPUTEXTENSION Lab.c
Lab.c:101: warning: initialization discards qualifiers from pointer target type
lsbcc -DX11_t -DTRANS_CLIENT -DUNIXCONN -c -DXT_X_RELEASE=6  -O -I. -I/opt/lsb-tet3-lite/inc/tet3 -I/nethome/autobuild/tmp/rpm-build/BUILD/lsb-test-xts5-5.1.5/xts5/src/lib -I/nethome/autobuild/tmp/rpm-build/BUILD/lsb-test-xts5-5.1.5/xts5/src/lib/X11 -I/nethome/autobuild/tmp/rpm-build/BUILD/lsb-test-xts5-5.1.5/xts5/include -DXTESTEXTENSION -DINPUTEXTENSION Quarks.c
lsbcc -DX11_t -DTRANS_CLIENT -DUNIXCONN -c -DXT_X_RELEASE=6  -O -I. -I/opt/lsb-tet3-lite/inc/tet3 -I/nethome/autobuild/tmp/rpm-build/BUILD/lsb-test-xts5-5.1.5/xts5/src/lib -I/nethome/autobuild/tmp/rpm-build/BUILD/lsb-test-xts5-5.1.5/xts5/src/lib/X11 -I/nethome/autobuild/tmp/rpm-build/BUILD/lsb-test-xts5-5.1.5/xts5/include -DXTESTEXTENSION -DINPUTEXTENSION cmsMath.c
lsbcc -DX11_t -DTRANS_CLIENT -DUNIXCONN -c -DXT_X_RELEASE=6  -O -I. -I/opt/lsb-tet3-lite/inc/tet3 -I/nethome/autobuild/tmp/rpm-build/BUILD/lsb-test-xts5-5.1.5/xts5/src/lib -I/nethome/autobuild/tmp/rpm-build/BUILD/lsb-test-xts5-5.1.5/xts5/src/lib/X11 -I/nethome/autobuild/tmp/rpm-build/BUILD/lsb-test-xts5-5.1.5/xts5/include -DXTESTEXTENSION -DINPUTEXTENSION XYZ.c
XYZ.c:84: warning: initialization discards qualifiers from pointer target type
lsbcc -DX11_t -DTRANS_CLIENT -DUNIXCONN -c -DXT_X_RELEASE=6  -O -I. -I/opt/lsb-tet3-lite/inc/tet3 -I/nethome/autobuild/tmp/rpm-build/BUILD/lsb-test-xts5-5.1.5/xts5/src/lib -I/nethome/autobuild/tmp/rpm-build/BUILD/lsb-test-xts5-5.1.5/xts5/src/lib/X11 -I/nethome/autobuild/tmp/rpm-build/BUILD/lsb-test-xts5-5.1.5/xts5/include -DXTESTEXTENSION -DINPUTEXTENSION CvCols.c
lsbcc -DX11_t -DTRANS_CLIENT -DUNIXCONN -c -DXT_X_RELEASE=6  -O -I. -I/opt/lsb-tet3-lite/inc/tet3 -I/nethome/autobuild/tmp/rpm-build/BUILD/lsb-test-xts5-5.1.5/xts5/src/lib -I/nethome/autobuild/tmp/rpm-build/BUILD/lsb-test-xts5-5.1.5/xts5/src/lib/X11 -I/nethome/autobuild/tmp/rpm-build/BUILD/lsb-test-xts5-5.1.5/xts5/include -DXTESTEXTENSION -DINPUTEXTENSION cmsGlobls.c
lsbcc -DX11_t -DTRANS_CLIENT -DUNIXCONN -c -DXT_X_RELEASE=6  -O -I. -I/opt/lsb-tet3-lite/inc/tet3 -I/nethome/autobuild/tmp/rpm-build/BUILD/lsb-test-xts5-5.1.5/xts5/src/lib -I/nethome/autobuild/tmp/rpm-build/BUILD/lsb-test-xts5-5.1.5/xts5/src/lib/X11 -I/nethome/autobuild/tmp/rpm-build/BUILD/lsb-test-xts5-5.1.5/xts5/include -DXTESTEXTENSION -DINPUTEXTENSION Luv.c
Luv.c:104: warning: initialization discards qualifiers from pointer target type
lsbcc -DX11_t -DTRANS_CLIENT -DUNIXCONN -c -DXT_X_RELEASE=6  -O -I. -I/opt/lsb-tet3-lite/inc/tet3 -I/nethome/autobuild/tmp/rpm-build/BUILD/lsb-test-xts5-5.1.5/xts5/src/lib -I/nethome/autobuild/tmp/rpm-build/BUILD/lsb-test-xts5-5.1.5/xts5/src/lib/X11 -I/nethome/autobuild/tmp/rpm-build/BUILD/lsb-test-xts5-5.1.5/xts5/include -DXTESTEXTENSION -DINPUTEXTENSION uvY.c
uvY.c:97: warning: initialization discards qualifiers from pointer target type
lsbcc -DX11_t -DTRANS_CLIENT -DUNIXCONN -c -DXT_X_RELEASE=6  -O -I. -I/opt/lsb-tet3-lite/inc/tet3 -I/nethome/autobuild/tmp/rpm-build/BUILD/lsb-test-xts5-5.1.5/xts5/src/lib -I/nethome/autobuild/tmp/rpm-build/BUILD/lsb-test-xts5-5.1.5/xts5/src/lib/X11 -I/nethome/autobuild/tmp/rpm-build/BUILD/lsb-test-xts5-5.1.5/xts5/include -DXTESTEXTENSION -DINPUTEXTENSION xyY.c
xyY.c:96: warning: initialization discards qualifiers from pointer target type
lsbcc -DX11_t -DTRANS_CLIENT -DUNIXCONN -c -DXT_X_RELEASE=6  -O -I. -I/opt/lsb-tet3-lite/inc/tet3 -I/nethome/autobuild/tmp/rpm-build/BUILD/lsb-test-xts5-5.1.5/xts5/src/lib -I/nethome/autobuild/tmp/rpm-build/BUILD/lsb-test-xts5-5.1.5/xts5/src/lib/X11 -I/nethome/autobuild/tmp/rpm-build/BUILD/lsb-test-xts5-5.1.5/xts5/include -DXTESTEXTENSION -DINPUTEXTENSION LRGB.c
LRGB.c:170: warning: initialization discards qualifiers from pointer target type
LRGB.c:183: warning: initialization discards qualifiers from pointer target type
lsbcc -DX11_t -DTRANS_CLIENT -DUNIXCONN -c -DXT_X_RELEASE=6  -O -I. -I/opt/lsb-tet3-lite/inc/tet3 -I/nethome/autobuild/tmp/rpm-build/BUILD/lsb-test-xts5-5.1.5/xts5/src/lib -I/nethome/autobuild/tmp/rpm-build/BUILD/lsb-test-xts5-5.1.5/xts5/src/lib/X11 -I/nethome/autobuild/tmp/rpm-build/BUILD/lsb-test-xts5-5.1.5/xts5/include -DXTESTEXTENSION -DINPUTEXTENSION HVC.c
HVC.c:137: warning: initialization discards qualifiers from pointer target type
lsbcc -DX11_t -DTRANS_CLIENT -DUNIXCONN -c -DXT_X_RELEASE=6  -O -I. -I/opt/lsb-tet3-lite/inc/tet3 -I/nethome/autobuild/tmp/rpm-build/BUILD/lsb-test-xts5-5.1.5/xts5/src/lib -I/nethome/autobuild/tmp/rpm-build/BUILD/lsb-test-xts5-5.1.5/xts5/src/lib/X11 -I/nethome/autobuild/tmp/rpm-build/BUILD/lsb-test-xts5-5.1.5/xts5/include -DXTESTEXTENSION -DINPUTEXTENSION UNDEFINED.c
lsbcc -DX11_t -DTRANS_CLIENT -DUNIXCONN -c -DXT_X_RELEASE=6  -O -I. -I/opt/lsb-tet3-lite/inc/tet3 -I/nethome/autobuild/tmp/rpm-build/BUILD/lsb-test-xts5-5.1.5/xts5/src/lib -I/nethome/autobuild/tmp/rpm-build/BUILD/lsb-test-xts5-5.1.5/xts5/src/lib/X11 -I/nethome/autobuild/tmp/rpm-build/BUILD/lsb-test-xts5-5.1.5/xts5/include -DXTESTEXTENSION -DINPUTEXTENSION cmsTrig.c
lsbcc -DX11_t -DTRANS_CLIENT -DUNIXCONN -c -DXT_X_RELEASE=6  -O -I. -I/opt/lsb-tet3-lite/inc/tet3 -I/nethome/autobuild/tmp/rpm-build/BUILD/lsb-test-xts5-5.1.5/xts5/src/lib -I/nethome/autobuild/tmp/rpm-build/BUILD/lsb-test-xts5-5.1.5/xts5/src/lib/X11 -I/nethome/autobuild/tmp/rpm-build/BUILD/lsb-test-xts5-5.1.5/xts5/include -DXTESTEXTENSION -DINPUTEXTENSION cmsInt.c
lsbcc -DX11_t -DTRANS_CLIENT -DUNIXCONN -c -DXT_X_RELEASE=6  -O -I. -I/opt/lsb-tet3-lite/inc/tet3 -I/nethome/autobuild/tmp/rpm-build/BUILD/lsb-test-xts5-5.1.5/xts5/src/lib -I/nethome/autobuild/tmp/rpm-build/BUILD/lsb-test-xts5-5.1.5/xts5/src/lib/X11 -I/nethome/autobuild/tmp/rpm-build/BUILD/lsb-test-xts5-5.1.5/xts5/include -DXTESTEXTENSION -DINPUTEXTENSION cmsProp.c
: ranlib libxtcms.a
lsbcc -DX11_t -DTRANS_CLIENT -DUNIXCONN -c -DXT_X_RELEASE=6  -O -I. -I/opt/lsb-tet3-lite/inc/tet3 -I/nethome/autobuild/tmp/rpm-build/BUILD/lsb-test-xts5-5.1.5/xts5/src/lib -I/nethome/autobuild/tmp/rpm-build/BUILD/lsb-test-xts5-5.1.5/xts5/src/lib/X11 -I/nethome/autobuild/tmp/rpm-build/BUILD/lsb-test-xts5-5.1.5/xts5/include -DXTESTEXTENSION -DINPUTEXTENSION Shell.c
lsbcc -DX11_t -DTRANS_CLIENT -DUNIXCONN -c -DXT_X_RELEASE=6  -O -I. -I/opt/lsb-tet3-lite/inc/tet3 -I/nethome/autobuild/tmp/rpm-build/BUILD/lsb-test-xts5-5.1.5/xts5/src/lib -I/nethome/autobuild/tmp/rpm-build/BUILD/lsb-test-xts5-5.1.5/xts5/src/lib/X11 -I/nethome/autobuild/tmp/rpm-build/BUILD/lsb-test-xts5-5.1.5/xts5/include -DXTESTEXTENSION -DINPUTEXTENSION Display.c
lsbcc -DX11_t -DTRANS_CLIENT -DUNIXCONN -c -DXT_X_RELEASE=6  -O -I. -I/opt/lsb-tet3-lite/inc/tet3 -I/nethome/autobuild/tmp/rpm-build/BUILD/lsb-test-xts5-5.1.5/xts5/src/lib -I/nethome/autobuild/tmp/rpm-build/BUILD/lsb-test-xts5-5.1.5/xts5/src/lib/X11 -I/nethome/autobuild/tmp/rpm-build/BUILD/lsb-test-xts5-5.1.5/xts5/include -DXTESTEXTENSION -DINPUTEXTENSION Intrinsic.c
lsbcc -DX11_t -DTRANS_CLIENT -DUNIXCONN -c -DXT_X_RELEASE=6  -O -I. -I/opt/lsb-tet3-lite/inc/tet3 -I/nethome/autobuild/tmp/rpm-build/BUILD/lsb-test-xts5-5.1.5/xts5/src/lib -I/nethome/autobuild/tmp/rpm-build/BUILD/lsb-test-xts5-5.1.5/xts5/src/lib/X11 -I/nethome/autobuild/tmp/rpm-build/BUILD/lsb-test-xts5-5.1.5/xts5/include -DXTESTEXTENSION -DINPUTEXTENSION Alloc.c
: ranlib libxtwdgt.a
lsbcc -DX11_t -DTRANS_CLIENT -DUNIXCONN -c -DXT_X_RELEASE=6  -O -I. -I/opt/lsb-tet3-lite/inc/tet3 -I/nethome/autobuild/tmp/rpm-build/BUILD/lsb-test-xts5-5.1.5/xts5/src/lib -I/nethome/autobuild/tmp/rpm-build/BUILD/lsb-test-xts5-5.1.5/xts5/src/lib/X11 -I/nethome/autobuild/tmp/rpm-build/BUILD/lsb-test-xts5-5.1.5/xts5/include -DXTESTEXTENSION -DINPUTEXTENSION Vendor.c
: ranlib libxtvendor.a
cp libxtest.a /nethome/autobuild/tmp/rpm-build/BUILD/lsb-test-xts5-5.1.5/xts5/lib
cp libxtestlsbcc.a /nethome/autobuild/tmp/rpm-build/BUILD/lsb-test-xts5-5.1.5/xts5/lib
cp: cannot stat `libxtestlsbcc.a': No such file or directory
make[2]: [install] Error 1 (ignored)
ranlib: '/nethome/autobuild/tmp/rpm-build/BUILD/lsb-test-xts5-5.1.5/xts5/lib/libxtestlsbcc.a': No such file
cp libxtcms.a /nethome/autobuild/tmp/rpm-build/BUILD/lsb-test-xts5-5.1.5/xts5/lib
cp libxtwdgt.a /nethome/autobuild/tmp/rpm-build/BUILD/lsb-test-xts5-5.1.5/xts5/lib
cp libxtvendor.a /nethome/autobuild/tmp/rpm-build/BUILD/lsb-test-xts5-5.1.5/xts5/lib
make[2]: Leaving directory `/nethome/autobuild/tmp/rpm-build/BUILD/lsb-test-xts5-5.1.5/xts5/src/lib'
Building libXst
make[2]: Entering directory `/nethome/autobuild/tmp/rpm-build/BUILD/lsb-test-xts5-5.1.5/xts5/src/libproto'
lsbcc -DX11_t -DTRANS_CLIENT -DUNIXCONN -DXT_X_RELEASE=6  -O -I. -I/opt/lsb-tet3-lite/inc/tet3 -I/nethome/autobuild/tmp/rpm-build/BUILD/lsb-test-xts5-5.1.5/xts5/src/lib -I/nethome/autobuild/tmp/rpm-build/BUILD/lsb-test-xts5-5.1.5/xts5/src/lib/X11 -I/nethome/autobuild/tmp/rpm-build/BUILD/lsb-test-xts5-5.1.5/xts5/include -DINPUTEXTENSION   -c -o ShowReq.o ShowReq.c
lsbcc -DX11_t -DTRANS_CLIENT -DUNIXCONN -DXT_X_RELEASE=6  -O -I. -I/opt/lsb-tet3-lite/inc/tet3 -I/nethome/autobuild/tmp/rpm-build/BUILD/lsb-test-xts5-5.1.5/xts5/src/lib -I/nethome/autobuild/tmp/rpm-build/BUILD/lsb-test-xts5-5.1.5/xts5/src/lib/X11 -I/nethome/autobuild/tmp/rpm-build/BUILD/lsb-test-xts5-5.1.5/xts5/include -DINPUTEXTENSION   -c -o ShowExtReq.o ShowExtReq.c
lsbcc -DX11_t -DTRANS_CLIENT -DUNIXCONN -DXT_X_RELEASE=6  -O -I. -I/opt/lsb-tet3-lite/inc/tet3 -I/nethome/autobuild/tmp/rpm-build/BUILD/lsb-test-xts5-5.1.5/xts5/src/lib -I/nethome/autobuild/tmp/rpm-build/BUILD/lsb-test-xts5-5.1.5/xts5/src/lib/X11 -I/nethome/autobuild/tmp/rpm-build/BUILD/lsb-test-xts5-5.1.5/xts5/include -DINPUTEXTENSION   -c -o SendReq.o SendReq.c
lsbcc -DX11_t -DTRANS_CLIENT -DUNIXCONN -DXT_X_RELEASE=6  -O -I. -I/opt/lsb-tet3-lite/inc/tet3 -I/nethome/autobuild/tmp/rpm-build/BUILD/lsb-test-xts5-5.1.5/xts5/src/lib -I/nethome/autobuild/tmp/rpm-build/BUILD/lsb-test-xts5-5.1.5/xts5/src/lib/X11 -I/nethome/autobuild/tmp/rpm-build/BUILD/lsb-test-xts5-5.1.5/xts5/include -DINPUTEXTENSION   -c -o SendXIReq.o SendXIReq.c
lsbcc -DX11_t -DTRANS_CLIENT -DUNIXCONN -DXT_X_RELEASE=6  -O -I. -I/opt/lsb-tet3-lite/inc/tet3 -I/nethome/autobuild/tmp/rpm-build/BUILD/lsb-test-xts5-5.1.5/xts5/src/lib -I/nethome/autobuild/tmp/rpm-build/BUILD/lsb-test-xts5-5.1.5/xts5/src/lib/X11 -I/nethome/autobuild/tmp/rpm-build/BUILD/lsb-test-xts5-5.1.5/xts5/include -DINPUTEXTENSION   -c -o SendEvt.o SendEvt.c
lsbcc -DX11_t -DTRANS_CLIENT -DUNIXCONN -DXT_X_RELEASE=6  -O -I. -I/opt/lsb-tet3-lite/inc/tet3 -I/nethome/autobuild/tmp/rpm-build/BUILD/lsb-test-xts5-5.1.5/xts5/src/lib -I/nethome/autobuild/tmp/rpm-build/BUILD/lsb-test-xts5-5.1.5/xts5/src/lib/X11 -I/nethome/autobuild/tmp/rpm-build/BUILD/lsb-test-xts5-5.1.5/xts5/include -DINPUTEXTENSION   -c -o ShowRep.o ShowRep.c
lsbcc -DX11_t -DTRANS_CLIENT -DUNIXCONN -DXT_X_RELEASE=6  -O -I. -I/opt/lsb-tet3-lite/inc/tet3 -I/nethome/autobuild/tmp/rpm-build/BUILD/lsb-test-xts5-5.1.5/xts5/src/lib -I/nethome/autobuild/tmp/rpm-build/BUILD/lsb-test-xts5-5.1.5/xts5/src/lib/X11 -I/nethome/autobuild/tmp/rpm-build/BUILD/lsb-test-xts5-5.1.5/xts5/include -DINPUTEXTENSION   -c -o ShowExtRep.o ShowExtRep.c
lsbcc -DX11_t -DTRANS_CLIENT -DUNIXCONN -DXT_X_RELEASE=6  -O -I. -I/opt/lsb-tet3-lite/inc/tet3 -I/nethome/autobuild/tmp/rpm-build/BUILD/lsb-test-xts5-5.1.5/xts5/src/lib -I/nethome/autobuild/tmp/rpm-build/BUILD/lsb-test-xts5-5.1.5/xts5/src/lib/X11 -I/nethome/autobuild/tmp/rpm-build/BUILD/lsb-test-xts5-5.1.5/xts5/include -DINPUTEXTENSION   -c -o MakeReq.o MakeReq.c
lsbcc -DX11_t -DTRANS_CLIENT -DUNIXCONN -DXT_X_RELEASE=6  -O -I. -I/opt/lsb-tet3-lite/inc/tet3 -I/nethome/autobuild/tmp/rpm-build/BUILD/lsb-test-xts5-5.1.5/xts5/src/lib -I/nethome/autobuild/tmp/rpm-build/BUILD/lsb-test-xts5-5.1.5/xts5/src/lib/X11 -I/nethome/autobuild/tmp/rpm-build/BUILD/lsb-test-xts5-5.1.5/xts5/include -DINPUTEXTENSION   -c -o MakeXIReq.o MakeXIReq.c
lsbcc -DX11_t -DTRANS_CLIENT -DUNIXCONN -DXT_X_RELEASE=6  -O -I. -I/opt/lsb-tet3-lite/inc/tet3 -I/nethome/autobuild/tmp/rpm-build/BUILD/lsb-test-xts5-5.1.5/xts5/src/lib -I/nethome/autobuild/tmp/rpm-build/BUILD/lsb-test-xts5-5.1.5/xts5/src/lib/X11 -I/nethome/autobuild/tmp/rpm-build/BUILD/lsb-test-xts5-5.1.5/xts5/include -DINPUTEXTENSION   -c -o RcvRep.o RcvRep.c
lsbcc -DX11_t -DTRANS_CLIENT -DUNIXCONN -DXT_X_RELEASE=6  -O -I. -I/opt/lsb-tet3-lite/inc/tet3 -I/nethome/autobuild/tmp/rpm-build/BUILD/lsb-test-xts5-5.1.5/xts5/src/lib -I/nethome/autobuild/tmp/rpm-build/BUILD/lsb-test-xts5-5.1.5/xts5/src/lib/X11 -I/nethome/autobuild/tmp/rpm-build/BUILD/lsb-test-xts5-5.1.5/xts5/include -DINPUTEXTENSION   -c -o RcvExtRep.o RcvExtRep.c
lsbcc -DX11_t -DTRANS_CLIENT -DUNIXCONN -DXT_X_RELEASE=6  -O -I. -I/opt/lsb-tet3-lite/inc/tet3 -I/nethome/autobuild/tmp/rpm-build/BUILD/lsb-test-xts5-5.1.5/xts5/src/lib -I/nethome/autobuild/tmp/rpm-build/BUILD/lsb-test-xts5-5.1.5/xts5/src/lib/X11 -I/nethome/autobuild/tmp/rpm-build/BUILD/lsb-test-xts5-5.1.5/xts5/include -DINPUTEXTENSION   -c -o RcvEvt.o RcvEvt.c
lsbcc -DX11_t -DTRANS_CLIENT -DUNIXCONN -DXT_X_RELEASE=6  -O -I. -I/opt/lsb-tet3-lite/inc/tet3 -I/nethome/autobuild/tmp/rpm-build/BUILD/lsb-test-xts5-5.1.5/xts5/src/lib -I/nethome/autobuild/tmp/rpm-build/BUILD/lsb-test-xts5-5.1.5/xts5/src/lib/X11 -I/nethome/autobuild/tmp/rpm-build/BUILD/lsb-test-xts5-5.1.5/xts5/include -DINPUTEXTENSION   -c -o RcvExtEvt.o RcvExtEvt.c
lsbcc -DX11_t -DTRANS_CLIENT -DUNIXCONN -DXT_X_RELEASE=6  -O -I. -I/opt/lsb-tet3-lite/inc/tet3 -I/nethome/autobuild/tmp/rpm-build/BUILD/lsb-test-xts5-5.1.5/xts5/src/lib -I/nethome/autobuild/tmp/rpm-build/BUILD/lsb-test-xts5-5.1.5/xts5/src/lib/X11 -I/nethome/autobuild/tmp/rpm-build/BUILD/lsb-test-xts5-5.1.5/xts5/include -DINPUTEXTENSION   -c -o RcvErr.o RcvErr.c
lsbcc -DX11_t -DTRANS_CLIENT -DUNIXCONN -DXT_X_RELEASE=6  -O -I. -I/opt/lsb-tet3-lite/inc/tet3 -I/nethome/autobuild/tmp/rpm-build/BUILD/lsb-test-xts5-5.1.5/xts5/src/lib -I/nethome/autobuild/tmp/rpm-build/BUILD/lsb-test-xts5-5.1.5/xts5/src/lib/X11 -I/nethome/autobuild/tmp/rpm-build/BUILD/lsb-test-xts5-5.1.5/xts5/include -DINPUTEXTENSION   -c -o RcvExtErr.o RcvExtErr.c
lsbcc -DX11_t -DTRANS_CLIENT -DUNIXCONN -DXT_X_RELEASE=6  -O -I. -I/opt/lsb-tet3-lite/inc/tet3 -I/nethome/autobuild/tmp/rpm-build/BUILD/lsb-test-xts5-5.1.5/xts5/src/lib -I/nethome/autobuild/tmp/rpm-build/BUILD/lsb-test-xts5-5.1.5/xts5/src/lib/X11 -I/nethome/autobuild/tmp/rpm-build/BUILD/lsb-test-xts5-5.1.5/xts5/include -DINPUTEXTENSION   -c -o ShowEvt.o ShowEvt.c
lsbcc -DX11_t -DTRANS_CLIENT -DUNIXCONN -DXT_X_RELEASE=6  -O -I. -I/opt/lsb-tet3-lite/inc/tet3 -I/nethome/autobuild/tmp/rpm-build/BUILD/lsb-test-xts5-5.1.5/xts5/src/lib -I/nethome/autobuild/tmp/rpm-build/BUILD/lsb-test-xts5-5.1.5/xts5/src/lib/X11 -I/nethome/autobuild/tmp/rpm-build/BUILD/lsb-test-xts5-5.1.5/xts5/include -DINPUTEXTENSION   -c -o ShowExtEvt.o ShowExtEvt.c
lsbcc -DX11_t -DTRANS_CLIENT -DUNIXCONN -DXT_X_RELEASE=6  -O -I. -I/opt/lsb-tet3-lite/inc/tet3 -I/nethome/autobuild/tmp/rpm-build/BUILD/lsb-test-xts5-5.1.5/xts5/src/lib -I/nethome/autobuild/tmp/rpm-build/BUILD/lsb-test-xts5-5.1.5/xts5/src/lib/X11 -I/nethome/autobuild/tmp/rpm-build/BUILD/lsb-test-xts5-5.1.5/xts5/include -DINPUTEXTENSION   -c -o ShowExtErr.o ShowExtErr.c
lsbcc -DX11_t -DTRANS_CLIENT -DUNIXCONN -DXT_X_RELEASE=6  -O -I. -I/opt/lsb-tet3-lite/inc/tet3 -I/nethome/autobuild/tmp/rpm-build/BUILD/lsb-test-xts5-5.1.5/xts5/src/lib -I/nethome/autobuild/tmp/rpm-build/BUILD/lsb-test-xts5-5.1.5/xts5/src/lib/X11 -I/nethome/autobuild/tmp/rpm-build/BUILD/lsb-test-xts5-5.1.5/xts5/include -DINPUTEXTENSION   -c -o ShowErr.o ShowErr.c
lsbcc -DX11_t -DTRANS_CLIENT -DUNIXCONN -DXT_X_RELEASE=6  -O -I. -I/opt/lsb-tet3-lite/inc/tet3 -I/nethome/autobuild/tmp/rpm-build/BUILD/lsb-test-xts5-5.1.5/xts5/src/lib -I/nethome/autobuild/tmp/rpm-build/BUILD/lsb-test-xts5-5.1.5/xts5/src/lib/X11 -I/nethome/autobuild/tmp/rpm-build/BUILD/lsb-test-xts5-5.1.5/xts5/include -DINPUTEXTENSION   -c -o DfltVals.o DfltVals.c
lsbcc -DX11_t -DTRANS_CLIENT -DUNIXCONN -DXT_X_RELEASE=6  -O -I. -I/opt/lsb-tet3-lite/inc/tet3 -I/nethome/autobuild/tmp/rpm-build/BUILD/lsb-test-xts5-5.1.5/xts5/src/lib -I/nethome/autobuild/tmp/rpm-build/BUILD/lsb-test-xts5-5.1.5/xts5/src/lib/X11 -I/nethome/autobuild/tmp/rpm-build/BUILD/lsb-test-xts5-5.1.5/xts5/include -DINPUTEXTENSION   -c -o ResMng.o ResMng.c
lsbcc -DX11_t -DTRANS_CLIENT -DUNIXCONN -DXT_X_RELEASE=6  -O -I. -I/opt/lsb-tet3-lite/inc/tet3 -I/nethome/autobuild/tmp/rpm-build/BUILD/lsb-test-xts5-5.1.5/xts5/src/lib -I/nethome/autobuild/tmp/rpm-build/BUILD/lsb-test-xts5-5.1.5/xts5/src/lib/X11 -I/nethome/autobuild/tmp/rpm-build/BUILD/lsb-test-xts5-5.1.5/xts5/include -DINPUTEXTENSION   -c -o Log.o Log.c
lsbcc -DX11_t -DTRANS_CLIENT -DUNIXCONN -DXT_X_RELEASE=6  -O -I. -I/opt/lsb-tet3-lite/inc/tet3 -I/nethome/autobuild/tmp/rpm-build/BUILD/lsb-test-xts5-5.1.5/xts5/src/lib -I/nethome/autobuild/tmp/rpm-build/BUILD/lsb-test-xts5-5.1.5/xts5/src/lib/X11 -I/nethome/autobuild/tmp/rpm-build/BUILD/lsb-test-xts5-5.1.5/xts5/include -DINPUTEXTENSION   -c -o ClientMng.o ClientMng.c
lsbcc -DX11_t -DTRANS_CLIENT -DUNIXCONN -DXT_X_RELEASE=6  -O -I. -I/opt/lsb-tet3-lite/inc/tet3 -I/nethome/autobuild/tmp/rpm-build/BUILD/lsb-test-xts5-5.1.5/xts5/src/lib -I/nethome/autobuild/tmp/rpm-build/BUILD/lsb-test-xts5-5.1.5/xts5/src/lib/X11 -I/nethome/autobuild/tmp/rpm-build/BUILD/lsb-test-xts5-5.1.5/xts5/include -DINPUTEXTENSION   -c -o Expect.o Expect.c
rm -f ConnOption.c
cp XlibXtst.c ConnOption.c
lsbcc -DX11_t -DTRANS_CLIENT -DUNIXCONN -DXT_X_RELEASE=6  -O -I. -I/opt/lsb-tet3-lite/inc/tet3 -I/nethome/autobuild/tmp/rpm-build/BUILD/lsb-test-xts5-5.1.5/xts5/src/lib -I/nethome/autobuild/tmp/rpm-build/BUILD/lsb-test-xts5-5.1.5/xts5/src/lib/X11 -I/nethome/autobuild/tmp/rpm-build/BUILD/lsb-test-xts5-5.1.5/xts5/include -DINPUTEXTENSION   -c -o ConnOption.o ConnOption.c
lsbcc -DX11_t -DTRANS_CLIENT -DUNIXCONN -DXT_X_RELEASE=6  -O -I. -I/opt/lsb-tet3-lite/inc/tet3 -I/nethome/autobuild/tmp/rpm-build/BUILD/lsb-test-xts5-5.1.5/xts5/src/lib -I/nethome/autobuild/tmp/rpm-build/BUILD/lsb-test-xts5-5.1.5/xts5/src/lib/X11 -I/nethome/autobuild/tmp/rpm-build/BUILD/lsb-test-xts5-5.1.5/xts5/include -DINPUTEXTENSION   -c -o ValListMng.o ValListMng.c
lsbcc -DX11_t -DTRANS_CLIENT -DUNIXCONN -DXT_X_RELEASE=6  -O -I. -I/opt/lsb-tet3-lite/inc/tet3 -I/nethome/autobuild/tmp/rpm-build/BUILD/lsb-test-xts5-5.1.5/xts5/src/lib -I/nethome/autobuild/tmp/rpm-build/BUILD/lsb-test-xts5-5.1.5/xts5/src/lib/X11 -I/nethome/autobuild/tmp/rpm-build/BUILD/lsb-test-xts5-5.1.5/xts5/include -DINPUTEXTENSION   -c -o Timer.o Timer.c
lsbcc -DX11_t -DTRANS_CLIENT -DUNIXCONN -DXT_X_RELEASE=6  -O -I. -I/opt/lsb-tet3-lite/inc/tet3 -I/nethome/autobuild/tmp/rpm-build/BUILD/lsb-test-xts5-5.1.5/xts5/src/lib -I/nethome/autobuild/tmp/rpm-build/BUILD/lsb-test-xts5-5.1.5/xts5/src/lib/X11 -I/nethome/autobuild/tmp/rpm-build/BUILD/lsb-test-xts5-5.1.5/xts5/include -DINPUTEXTENSION   -c -o XstIO.o XstIO.c
lsbcc -DX11_t -DTRANS_CLIENT -DUNIXCONN -DXT_X_RELEASE=6  -O -I. -I/opt/lsb-tet3-lite/inc/tet3 -I/nethome/autobuild/tmp/rpm-build/BUILD/lsb-test-xts5-5.1.5/xts5/src/lib -I/nethome/autobuild/tmp/rpm-build/BUILD/lsb-test-xts5-5.1.5/xts5/src/lib/X11 -I/nethome/autobuild/tmp/rpm-build/BUILD/lsb-test-xts5-5.1.5/xts5/include -DINPUTEXTENSION   -c -o DataMove.o DataMove.c
lsbcc -DX11_t -DTRANS_CLIENT -DUNIXCONN -DXT_X_RELEASE=6  -O -I. -I/opt/lsb-tet3-lite/inc/tet3 -I/nethome/autobuild/tmp/rpm-build/BUILD/lsb-test-xts5-5.1.5/xts5/src/lib -I/nethome/autobuild/tmp/rpm-build/BUILD/lsb-test-xts5-5.1.5/xts5/src/lib/X11 -I/nethome/autobuild/tmp/rpm-build/BUILD/lsb-test-xts5-5.1.5/xts5/include -DINPUTEXTENSION   -c -o TestMng.o TestMng.c
lsbcc -DX11_t -DTRANS_CLIENT -DUNIXCONN -DXT_X_RELEASE=6  -O -I. -I/opt/lsb-tet3-lite/inc/tet3 -I/nethome/autobuild/tmp/rpm-build/BUILD/lsb-test-xts5-5.1.5/xts5/src/lib -I/nethome/autobuild/tmp/rpm-build/BUILD/lsb-test-xts5-5.1.5/xts5/src/lib/X11 -I/nethome/autobuild/tmp/rpm-build/BUILD/lsb-test-xts5-5.1.5/xts5/include -DINPUTEXTENSION   -c -o Utils.o Utils.c
lsbcc -DX11_t -DTRANS_CLIENT -DUNIXCONN -DXT_X_RELEASE=6  -O -I. -I/opt/lsb-tet3-lite/inc/tet3 -I/nethome/autobuild/tmp/rpm-build/BUILD/lsb-test-xts5-5.1.5/xts5/src/lib -I/nethome/autobuild/tmp/rpm-build/BUILD/lsb-test-xts5-5.1.5/xts5/src/lib/X11 -I/nethome/autobuild/tmp/rpm-build/BUILD/lsb-test-xts5-5.1.5/xts5/include -DINPUTEXTENSION   -c -o SendSup.o SendSup.c
lsbcc -DX11_t -DTRANS_CLIENT -DUNIXCONN -DXT_X_RELEASE=6  -O -I. -I/opt/lsb-tet3-lite/inc/tet3 -I/nethome/autobuild/tmp/rpm-build/BUILD/lsb-test-xts5-5.1.5/xts5/src/lib -I/nethome/autobuild/tmp/rpm-build/BUILD/lsb-test-xts5-5.1.5/xts5/src/lib/X11 -I/nethome/autobuild/tmp/rpm-build/BUILD/lsb-test-xts5-5.1.5/xts5/include -DINPUTEXTENSION   -c -o ShowSup.o ShowSup.c
lsbcc -DX11_t -DTRANS_CLIENT -DUNIXCONN -DXT_X_RELEASE=6  -O -I. -I/opt/lsb-tet3-lite/inc/tet3 -I/nethome/autobuild/tmp/rpm-build/BUILD/lsb-test-xts5-5.1.5/xts5/src/lib -I/nethome/autobuild/tmp/rpm-build/BUILD/lsb-test-xts5-5.1.5/xts5/src/lib/X11 -I/nethome/autobuild/tmp/rpm-build/BUILD/lsb-test-xts5-5.1.5/xts5/include -DINPUTEXTENSION   -c -o TestSup.o TestSup.c
lsbcc -DX11_t -DTRANS_CLIENT -DUNIXCONN -DXT_X_RELEASE=6  -O -I. -I/opt/lsb-tet3-lite/inc/tet3 -I/nethome/autobuild/tmp/rpm-build/BUILD/lsb-test-xts5-5.1.5/xts5/src/lib -I/nethome/autobuild/tmp/rpm-build/BUILD/lsb-test-xts5-5.1.5/xts5/src/lib/X11 -I/nethome/autobuild/tmp/rpm-build/BUILD/lsb-test-xts5-5.1.5/xts5/include -DINPUTEXTENSION   -c -o Validate.o Validate.c
lsbcc -DX11_t -DTRANS_CLIENT -DUNIXCONN -DXT_X_RELEASE=6  -O -I. -I/opt/lsb-tet3-lite/inc/tet3 -I/nethome/autobuild/tmp/rpm-build/BUILD/lsb-test-xts5-5.1.5/xts5/src/lib -I/nethome/autobuild/tmp/rpm-build/BUILD/lsb-test-xts5-5.1.5/xts5/src/lib/X11 -I/nethome/autobuild/tmp/rpm-build/BUILD/lsb-test-xts5-5.1.5/xts5/include -DINPUTEXTENSION   -c -o tpstartup.o tpstartup.c
lsbcc -DX11_t -DTRANS_CLIENT -DUNIXCONN -DXT_X_RELEASE=6  -O -I. -I/opt/lsb-tet3-lite/inc/tet3 -I/nethome/autobuild/tmp/rpm-build/BUILD/lsb-test-xts5-5.1.5/xts5/src/lib -I/nethome/autobuild/tmp/rpm-build/BUILD/lsb-test-xts5-5.1.5/xts5/src/lib/X11 -I/nethome/autobuild/tmp/rpm-build/BUILD/lsb-test-xts5-5.1.5/xts5/include -DINPUTEXTENSION   -c -o startup.o startup.c
lsbcc -DX11_t -DTRANS_CLIENT -DUNIXCONN -DXT_X_RELEASE=6  -O -I. -I/opt/lsb-tet3-lite/inc/tet3 -I/nethome/autobuild/tmp/rpm-build/BUILD/lsb-test-xts5-5.1.5/xts5/src/lib -I/nethome/autobuild/tmp/rpm-build/BUILD/lsb-test-xts5-5.1.5/xts5/src/lib/X11 -I/nethome/autobuild/tmp/rpm-build/BUILD/lsb-test-xts5-5.1.5/xts5/include -DINPUTEXTENSION   -c -o linkstart.o linkstart.c
lsbcc -DX11_t -DTRANS_CLIENT -DUNIXCONN -DXT_X_RELEASE=6  -O -I. -I/opt/lsb-tet3-lite/inc/tet3 -I/nethome/autobuild/tmp/rpm-build/BUILD/lsb-test-xts5-5.1.5/xts5/src/lib -I/nethome/autobuild/tmp/rpm-build/BUILD/lsb-test-xts5-5.1.5/xts5/src/lib/X11 -I/nethome/autobuild/tmp/rpm-build/BUILD/lsb-test-xts5-5.1.5/xts5/include -DINPUTEXTENSION   -c -o delete.o delete.c
rm -f libXst.a
ar cr libXst.a `echo ShowReq.o ShowExtReq.o SendReq.o SendXIReq.o SendEvt.o ShowRep.o ShowExtRep.o MakeReq.o MakeXIReq.o RcvRep.o RcvExtRep.o RcvEvt.o RcvExtEvt.o RcvErr.o RcvExtErr.o ShowEvt.o ShowExtEvt.o ShowExtErr.o ShowErr.o DfltVals.o ResMng.o Log.o ClientMng.o Expect.o ConnOption.o ValListMng.o Timer.o XstIO.o DataMove.o TestMng.o Utils.o SendSup.o ShowSup.o TestSup.o Validate.o tpstartup.o startup.o linkstart.o delete.o | cat`
: ranlib libXst.a
cp libXst.a /nethome/autobuild/tmp/rpm-build/BUILD/lsb-test-xts5-5.1.5/xts5/lib/libXst.a
make[2]: Leaving directory `/nethome/autobuild/tmp/rpm-build/BUILD/lsb-test-xts5-5.1.5/xts5/src/libproto'
Building libximtest
make[2]: Entering directory `/nethome/autobuild/tmp/rpm-build/BUILD/lsb-test-xts5-5.1.5/xts5/src/xim'
lsbcc -DX11_t -DTRANS_CLIENT -DUNIXCONN -DXT_X_RELEASE=6  -O -I. -I/opt/lsb-tet3-lite/inc/tet3 -I/nethome/autobuild/tmp/rpm-build/BUILD/lsb-test-xts5-5.1.5/xts5/src/lib -I/nethome/autobuild/tmp/rpm-build/BUILD/lsb-test-xts5-5.1.5/xts5/src/lib/X11 -I/nethome/autobuild/tmp/rpm-build/BUILD/lsb-test-xts5-5.1.5/xts5/include -DXTESTEXTENSION -DINPUTEXTENSION   -c -o linklocale.o linklocale.c
lsbcc -DX11_t -DTRANS_CLIENT -DUNIXCONN -DXT_X_RELEASE=6  -O -I. -I/opt/lsb-tet3-lite/inc/tet3 -I/nethome/autobuild/tmp/rpm-build/BUILD/lsb-test-xts5-5.1.5/xts5/src/lib -I/nethome/autobuild/tmp/rpm-build/BUILD/lsb-test-xts5-5.1.5/xts5/src/lib/X11 -I/nethome/autobuild/tmp/rpm-build/BUILD/lsb-test-xts5-5.1.5/xts5/include -DXTESTEXTENSION -DINPUTEXTENSION   -c -o clnlocale.o clnlocale.c
lsbcc -DX11_t -DTRANS_CLIENT -DUNIXCONN -DXT_X_RELEASE=6  -O -I. -I/opt/lsb-tet3-lite/inc/tet3 -I/nethome/autobuild/tmp/rpm-build/BUILD/lsb-test-xts5-5.1.5/xts5/src/lib -I/nethome/autobuild/tmp/rpm-build/BUILD/lsb-test-xts5-5.1.5/xts5/src/lib/X11 -I/nethome/autobuild/tmp/rpm-build/BUILD/lsb-test-xts5-5.1.5/xts5/include -DXTESTEXTENSION -DINPUTEXTENSION   -c -o ic.o ic.c
lsbcc -DX11_t -DTRANS_CLIENT -DUNIXCONN -DXT_X_RELEASE=6  -O -I. -I/opt/lsb-tet3-lite/inc/tet3 -I/nethome/autobuild/tmp/rpm-build/BUILD/lsb-test-xts5-5.1.5/xts5/src/lib -I/nethome/autobuild/tmp/rpm-build/BUILD/lsb-test-xts5-5.1.5/xts5/src/lib/X11 -I/nethome/autobuild/tmp/rpm-build/BUILD/lsb-test-xts5-5.1.5/xts5/include -DXTESTEXTENSION -DINPUTEXTENSION   -c -o nextlocale.o nextlocale.c
lsbcc -DX11_t -DTRANS_CLIENT -DUNIXCONN -DXT_X_RELEASE=6  -O -I. -I/opt/lsb-tet3-lite/inc/tet3 -I/nethome/autobuild/tmp/rpm-build/BUILD/lsb-test-xts5-5.1.5/xts5/src/lib -I/nethome/autobuild/tmp/rpm-build/BUILD/lsb-test-xts5-5.1.5/xts5/src/lib/X11 -I/nethome/autobuild/tmp/rpm-build/BUILD/lsb-test-xts5-5.1.5/xts5/include -DXTESTEXTENSION -DINPUTEXTENSION   -c -o nextlclmod.o nextlclmod.c
lsbcc -DX11_t -DTRANS_CLIENT -DUNIXCONN -DXT_X_RELEASE=6  -O -I. -I/opt/lsb-tet3-lite/inc/tet3 -I/nethome/autobuild/tmp/rpm-build/BUILD/lsb-test-xts5-5.1.5/xts5/src/lib -I/nethome/autobuild/tmp/rpm-build/BUILD/lsb-test-xts5-5.1.5/xts5/src/lib/X11 -I/nethome/autobuild/tmp/rpm-build/BUILD/lsb-test-xts5-5.1.5/xts5/include -DXTESTEXTENSION -DINPUTEXTENSION   -c -o nxtfontset.o nxtfontset.c
lsbcc -DX11_t -DTRANS_CLIENT -DUNIXCONN -DXT_X_RELEASE=6  -O -I. -I/opt/lsb-tet3-lite/inc/tet3 -I/nethome/autobuild/tmp/rpm-build/BUILD/lsb-test-xts5-5.1.5/xts5/src/lib -I/nethome/autobuild/tmp/rpm-build/BUILD/lsb-test-xts5-5.1.5/xts5/src/lib/X11 -I/nethome/autobuild/tmp/rpm-build/BUILD/lsb-test-xts5-5.1.5/xts5/include -DXTESTEXTENSION -DINPUTEXTENSION   -c -o parse.o parse.c
lsbcc -DX11_t -DTRANS_CLIENT -DUNIXCONN -DXT_X_RELEASE=6  -O -I. -I/opt/lsb-tet3-lite/inc/tet3 -I/nethome/autobuild/tmp/rpm-build/BUILD/lsb-test-xts5-5.1.5/xts5/src/lib -I/nethome/autobuild/tmp/rpm-build/BUILD/lsb-test-xts5-5.1.5/xts5/src/lib/X11 -I/nethome/autobuild/tmp/rpm-build/BUILD/lsb-test-xts5-5.1.5/xts5/include -DXTESTEXTENSION -DINPUTEXTENSION   -c -o xim_cb.o xim_cb.c
xim_cb.c: In function ‘xim_copy_pixmap’:
xim_cb.c:195: warning: return makes integer from pointer without a cast
xim_cb.c: In function ‘xim_ic_setup’:
xim_cb.c:481: warning: comparison between pointer and integer
lsbcc -DX11_t -DTRANS_CLIENT -DUNIXCONN -DXT_X_RELEASE=6  -O -I. -I/opt/lsb-tet3-lite/inc/tet3 -I/nethome/autobuild/tmp/rpm-build/BUILD/lsb-test-xts5-5.1.5/xts5/src/lib -I/nethome/autobuild/tmp/rpm-build/BUILD/lsb-test-xts5-5.1.5/xts5/src/lib/X11 -I/nethome/autobuild/tmp/rpm-build/BUILD/lsb-test-xts5-5.1.5/xts5/include -DXTESTEXTENSION -DINPUTEXTENSION   -c -o xim_comp.o xim_comp.c
lsbcc -DX11_t -DTRANS_CLIENT -DUNIXCONN -DXT_X_RELEASE=6  -O -I. -I/opt/lsb-tet3-lite/inc/tet3 -I/nethome/autobuild/tmp/rpm-build/BUILD/lsb-test-xts5-5.1.5/xts5/src/lib -I/nethome/autobuild/tmp/rpm-build/BUILD/lsb-test-xts5-5.1.5/xts5/src/lib/X11 -I/nethome/autobuild/tmp/rpm-build/BUILD/lsb-test-xts5-5.1.5/xts5/include -DXTESTEXTENSION -DINPUTEXTENSION   -c -o response.o response.c
response.c: In function ‘xim_response_pop_cb’:
response.c:456: warning: comparison between pointer and integer
response.c:457: warning: passing argument 1 of ‘free’ makes pointer from integer without a cast
response.c: In function ‘read_pixmap’:
response.c:1137: warning: return makes integer from pointer without a cast
lsbcc -DX11_t -DTRANS_CLIENT -DUNIXCONN -DXT_X_RELEASE=6  -O -I. -I/opt/lsb-tet3-lite/inc/tet3 -I/nethome/autobuild/tmp/rpm-build/BUILD/lsb-test-xts5-5.1.5/xts5/src/lib -I/nethome/autobuild/tmp/rpm-build/BUILD/lsb-test-xts5-5.1.5/xts5/src/lib/X11 -I/nethome/autobuild/tmp/rpm-build/BUILD/lsb-test-xts5-5.1.5/xts5/include -DXTESTEXTENSION -DINPUTEXTENSION   -c -o xim_save.o xim_save.c
lsbcc -DX11_t -DTRANS_CLIENT -DUNIXCONN -DXT_X_RELEASE=6  -O -I. -I/opt/lsb-tet3-lite/inc/tet3 -I/nethome/autobuild/tmp/rpm-build/BUILD/lsb-test-xts5-5.1.5/xts5/src/lib -I/nethome/autobuild/tmp/rpm-build/BUILD/lsb-test-xts5-5.1.5/xts5/src/lib/X11 -I/nethome/autobuild/tmp/rpm-build/BUILD/lsb-test-xts5-5.1.5/xts5/include -DXTESTEXTENSION -DINPUTEXTENSION   -c -o stimulus.o stimulus.c
ar cr libximtest.a `echo linklocale.o clnlocale.o ic.o nextlocale.o nextlclmod.o nxtfontset.o parse.o xim_cb.o xim_comp.o response.o xim_save.o stimulus.o | cat`
cp libximtest.a /nethome/autobuild/tmp/rpm-build/BUILD/lsb-test-xts5-5.1.5/xts5/lib/libximtest.a
make[2]: Leaving directory `/nethome/autobuild/tmp/rpm-build/BUILD/lsb-test-xts5-5.1.5/xts5/src/xim'
Building libfonts
make[2]: Entering directory `/nethome/autobuild/tmp/rpm-build/BUILD/lsb-test-xts5-5.1.5/xts5/fonts'
lsbcc -DX11_t -DTRANS_CLIENT -DUNIXCONN -DXT_X_RELEASE=6  -O -I. -I/opt/lsb-tet3-lite/inc/tet3 -I/nethome/autobuild/tmp/rpm-build/BUILD/lsb-test-xts5-5.1.5/xts5/src/lib -I/nethome/autobuild/tmp/rpm-build/BUILD/lsb-test-xts5-5.1.5/xts5/src/lib/X11 -I/nethome/autobuild/tmp/rpm-build/BUILD/lsb-test-xts5-5.1.5/xts5/include -DXTESTEXTENSION -DINPUTEXTENSION   -c -o xtfont0.o xtfont0.c
lsbcc -DX11_t -DTRANS_CLIENT -DUNIXCONN -DXT_X_RELEASE=6  -O -I. -I/opt/lsb-tet3-lite/inc/tet3 -I/nethome/autobuild/tmp/rpm-build/BUILD/lsb-test-xts5-5.1.5/xts5/src/lib -I/nethome/autobuild/tmp/rpm-build/BUILD/lsb-test-xts5-5.1.5/xts5/src/lib/X11 -I/nethome/autobuild/tmp/rpm-build/BUILD/lsb-test-xts5-5.1.5/xts5/include -DXTESTEXTENSION -DINPUTEXTENSION   -c -o xtfont1.o xtfont1.c
lsbcc -DX11_t -DTRANS_CLIENT -DUNIXCONN -DXT_X_RELEASE=6  -O -I. -I/opt/lsb-tet3-lite/inc/tet3 -I/nethome/autobuild/tmp/rpm-build/BUILD/lsb-test-xts5-5.1.5/xts5/src/lib -I/nethome/autobuild/tmp/rpm-build/BUILD/lsb-test-xts5-5.1.5/xts5/src/lib/X11 -I/nethome/autobuild/tmp/rpm-build/BUILD/lsb-test-xts5-5.1.5/xts5/include -DXTESTEXTENSION -DINPUTEXTENSION   -c -o xtfont2.o xtfont2.c
lsbcc -DX11_t -DTRANS_CLIENT -DUNIXCONN -DXT_X_RELEASE=6  -O -I. -I/opt/lsb-tet3-lite/inc/tet3 -I/nethome/autobuild/tmp/rpm-build/BUILD/lsb-test-xts5-5.1.5/xts5/src/lib -I/nethome/autobuild/tmp/rpm-build/BUILD/lsb-test-xts5-5.1.5/xts5/src/lib/X11 -I/nethome/autobuild/tmp/rpm-build/BUILD/lsb-test-xts5-5.1.5/xts5/include -DXTESTEXTENSION -DINPUTEXTENSION   -c -o xtfont3.o xtfont3.c
lsbcc -DX11_t -DTRANS_CLIENT -DUNIXCONN -DXT_X_RELEASE=6  -O -I. -I/opt/lsb-tet3-lite/inc/tet3 -I/nethome/autobuild/tmp/rpm-build/BUILD/lsb-test-xts5-5.1.5/xts5/src/lib -I/nethome/autobuild/tmp/rpm-build/BUILD/lsb-test-xts5-5.1.5/xts5/src/lib/X11 -I/nethome/autobuild/tmp/rpm-build/BUILD/lsb-test-xts5-5.1.5/xts5/include -DXTESTEXTENSION -DINPUTEXTENSION   -c -o xtfont4.o xtfont4.c
lsbcc -DX11_t -DTRANS_CLIENT -DUNIXCONN -DXT_X_RELEASE=6  -O -I. -I/opt/lsb-tet3-lite/inc/tet3 -I/nethome/autobuild/tmp/rpm-build/BUILD/lsb-test-xts5-5.1.5/xts5/src/lib -I/nethome/autobuild/tmp/rpm-build/BUILD/lsb-test-xts5-5.1.5/xts5/src/lib/X11 -I/nethome/autobuild/tmp/rpm-build/BUILD/lsb-test-xts5-5.1.5/xts5/include -DXTESTEXTENSION -DINPUTEXTENSION   -c -o xtfont5.o xtfont5.c
lsbcc -DX11_t -DTRANS_CLIENT -DUNIXCONN -DXT_X_RELEASE=6  -O -I. -I/opt/lsb-tet3-lite/inc/tet3 -I/nethome/autobuild/tmp/rpm-build/BUILD/lsb-test-xts5-5.1.5/xts5/src/lib -I/nethome/autobuild/tmp/rpm-build/BUILD/lsb-test-xts5-5.1.5/xts5/src/lib/X11 -I/nethome/autobuild/tmp/rpm-build/BUILD/lsb-test-xts5-5.1.5/xts5/include -DXTESTEXTENSION -DINPUTEXTENSION   -c -o xtfont6.o xtfont6.c
ar cr libfont.a `echo xtfont0.o xtfont1.o xtfont2.o xtfont3.o xtfont4.o xtfont5.o xtfont6.o | cat`
: ranlib libfont.a
cp libfont.a /nethome/autobuild/tmp/rpm-build/BUILD/lsb-test-xts5-5.1.5/xts5/lib
ranlib /nethome/autobuild/tmp/rpm-build/BUILD/lsb-test-xts5-5.1.5/xts5/lib/libfont.a
make[2]: Leaving directory `/nethome/autobuild/tmp/rpm-build/BUILD/lsb-test-xts5-5.1.5/xts5/fonts'
Building libXR5
make[2]: Entering directory `/nethome/autobuild/tmp/rpm-build/BUILD/lsb-test-xts5-5.1.5/xts5/src/libXR5'
lsbcc -DX11_t -DTRANS_CLIENT -DUNIXCONN -DDEBUG -c -DXT_X_RELEASE=6  -O -I. -I/opt/lsb-tet3-lite/inc/tet3 -I/nethome/autobuild/tmp/rpm-build/BUILD/lsb-test-xts5-5.1.5/xts5/src/lib -I/nethome/autobuild/tmp/rpm-build/BUILD/lsb-test-xts5-5.1.5/xts5/src/lib/X11 -I/nethome/autobuild/tmp/rpm-build/BUILD/lsb-test-xts5-5.1.5/xts5/include -DXTESTEXTENSION -DINPUTEXTENSION r5startup.c
lsbcc -DX11_t -DTRANS_CLIENT -DUNIXCONN -DDEBUG -c -DXT_X_RELEASE=6  -O -I. -I/opt/lsb-tet3-lite/inc/tet3 -I/nethome/autobuild/tmp/rpm-build/BUILD/lsb-test-xts5-5.1.5/xts5/src/lib -I/nethome/autobuild/tmp/rpm-build/BUILD/lsb-test-xts5-5.1.5/xts5/src/lib/X11 -I/nethome/autobuild/tmp/rpm-build/BUILD/lsb-test-xts5-5.1.5/xts5/include -DXTESTEXTENSION -DINPUTEXTENSION message.c
lsbcc -DX11_t -DTRANS_CLIENT -DUNIXCONN -DDEBUG -c -DXT_X_RELEASE=6  -O -I. -I/opt/lsb-tet3-lite/inc/tet3 -I/nethome/autobuild/tmp/rpm-build/BUILD/lsb-test-xts5-5.1.5/xts5/src/lib -I/nethome/autobuild/tmp/rpm-build/BUILD/lsb-test-xts5-5.1.5/xts5/src/lib/X11 -I/nethome/autobuild/tmp/rpm-build/BUILD/lsb-test-xts5-5.1.5/xts5/include -DXTESTEXTENSION -DINPUTEXTENSION dumpbuf.c
lsbcc -DX11_t -DTRANS_CLIENT -DUNIXCONN -DDEBUG -c -DXT_X_RELEASE=6  -O -I. -I/opt/lsb-tet3-lite/inc/tet3 -I/nethome/autobuild/tmp/rpm-build/BUILD/lsb-test-xts5-5.1.5/xts5/src/lib -I/nethome/autobuild/tmp/rpm-build/BUILD/lsb-test-xts5-5.1.5/xts5/src/lib/X11 -I/nethome/autobuild/tmp/rpm-build/BUILD/lsb-test-xts5-5.1.5/xts5/include -DXTESTEXTENSION -DINPUTEXTENSION save.c
lsbcc -DX11_t -DTRANS_CLIENT -DUNIXCONN -DDEBUG -c -DXT_X_RELEASE=6  -O -I. -I/opt/lsb-tet3-lite/inc/tet3 -I/nethome/autobuild/tmp/rpm-build/BUILD/lsb-test-xts5-5.1.5/xts5/src/lib -I/nethome/autobuild/tmp/rpm-build/BUILD/lsb-test-xts5-5.1.5/xts5/src/lib/X11 -I/nethome/autobuild/tmp/rpm-build/BUILD/lsb-test-xts5-5.1.5/xts5/include -DXTESTEXTENSION -DINPUTEXTENSION misc.c
lsbcc -DX11_t -DTRANS_CLIENT -DUNIXCONN -DDEBUG -c -DXT_X_RELEASE=6  -O -I. -I/opt/lsb-tet3-lite/inc/tet3 -I/nethome/autobuild/tmp/rpm-build/BUILD/lsb-test-xts5-5.1.5/xts5/src/lib -I/nethome/autobuild/tmp/rpm-build/BUILD/lsb-test-xts5-5.1.5/xts5/src/lib/X11 -I/nethome/autobuild/tmp/rpm-build/BUILD/lsb-test-xts5-5.1.5/xts5/include -DXTESTEXTENSION -DINPUTEXTENSION blowup.c
lsbcc -DX11_t -DTRANS_CLIENT -DUNIXCONN -DDEBUG -c -DXT_X_RELEASE=6  -O -I. -I/opt/lsb-tet3-lite/inc/tet3 -I/nethome/autobuild/tmp/rpm-build/BUILD/lsb-test-xts5-5.1.5/xts5/src/lib -I/nethome/autobuild/tmp/rpm-build/BUILD/lsb-test-xts5-5.1.5/xts5/src/lib/X11 -I/nethome/autobuild/tmp/rpm-build/BUILD/lsb-test-xts5-5.1.5/xts5/include -DXTESTEXTENSION -DINPUTEXTENSION item.c
lsbcc -DX11_t -DTRANS_CLIENT -DUNIXCONN -DDEBUG -c -DXT_X_RELEASE=6  -O -I. -I/opt/lsb-tet3-lite/inc/tet3 -I/nethome/autobuild/tmp/rpm-build/BUILD/lsb-test-xts5-5.1.5/xts5/src/lib -I/nethome/autobuild/tmp/rpm-build/BUILD/lsb-test-xts5-5.1.5/xts5/src/lib/X11 -I/nethome/autobuild/tmp/rpm-build/BUILD/lsb-test-xts5-5.1.5/xts5/include -DXTESTEXTENSION -DINPUTEXTENSION signal.c
lsbcc -DX11_t -DTRANS_CLIENT -DUNIXCONN -DDEBUG -c -DXT_X_RELEASE=6  -O -I. -I/opt/lsb-tet3-lite/inc/tet3 -I/nethome/autobuild/tmp/rpm-build/BUILD/lsb-test-xts5-5.1.5/xts5/src/lib -I/nethome/autobuild/tmp/rpm-build/BUILD/lsb-test-xts5-5.1.5/xts5/src/lib/X11 -I/nethome/autobuild/tmp/rpm-build/BUILD/lsb-test-xts5-5.1.5/xts5/include -DXTESTEXTENSION -DINPUTEXTENSION bufdisp.c
lsbcc -DX11_t -DTRANS_CLIENT -DUNIXCONN -DDEBUG -c -DXT_X_RELEASE=6  -O -I. -I/opt/lsb-tet3-lite/inc/tet3 -I/nethome/autobuild/tmp/rpm-build/BUILD/lsb-test-xts5-5.1.5/xts5/src/lib -I/nethome/autobuild/tmp/rpm-build/BUILD/lsb-test-xts5-5.1.5/xts5/src/lib/X11 -I/nethome/autobuild/tmp/rpm-build/BUILD/lsb-test-xts5-5.1.5/xts5/include -DXTESTEXTENSION -DINPUTEXTENSION chek.c
lsbcc -DX11_t -DTRANS_CLIENT -DUNIXCONN -DDEBUG -c -DXT_X_RELEASE=6  -O -I. -I/opt/lsb-tet3-lite/inc/tet3 -I/nethome/autobuild/tmp/rpm-build/BUILD/lsb-test-xts5-5.1.5/xts5/src/lib -I/nethome/autobuild/tmp/rpm-build/BUILD/lsb-test-xts5-5.1.5/xts5/src/lib/X11 -I/nethome/autobuild/tmp/rpm-build/BUILD/lsb-test-xts5-5.1.5/xts5/include -DXTESTEXTENSION -DINPUTEXTENSION event.c
: ranlib libXR5.a
cp libXR5.a /nethome/autobuild/tmp/rpm-build/BUILD/lsb-test-xts5-5.1.5/xts5/lib
make[2]: Leaving directory `/nethome/autobuild/tmp/rpm-build/BUILD/lsb-test-xts5-5.1.5/xts5/src/libXR5'
Building libXtaw
make[2]: Entering directory `/nethome/autobuild/tmp/rpm-build/BUILD/lsb-test-xts5-5.1.5/xts5/src/libXtaw'
lsbcc -DX11_t -DTRANS_CLIENT -DUNIXCONN -c -DXT_X_RELEASE=6  -O -I. -I/opt/lsb-tet3-lite/inc/tet3 -I/nethome/autobuild/tmp/rpm-build/BUILD/lsb-test-xts5-5.1.5/xts5/src/lib -I/nethome/autobuild/tmp/rpm-build/BUILD/lsb-test-xts5-5.1.5/xts5/src/lib/X11 -I/nethome/autobuild/tmp/rpm-build/BUILD/lsb-test-xts5-5.1.5/xts5/include -DXTESTEXTENSION -DINPUTEXTENSION AllWidgets.c
lsbcc -DX11_t -DTRANS_CLIENT -DUNIXCONN -c -DXT_X_RELEASE=6  -O -I. -I/opt/lsb-tet3-lite/inc/tet3 -I/nethome/autobuild/tmp/rpm-build/BUILD/lsb-test-xts5-5.1.5/xts5/src/lib -I/nethome/autobuild/tmp/rpm-build/BUILD/lsb-test-xts5-5.1.5/xts5/src/lib/X11 -I/nethome/autobuild/tmp/rpm-build/BUILD/lsb-test-xts5-5.1.5/xts5/include -DXTESTEXTENSION -DINPUTEXTENSION Box.c
lsbcc -DX11_t -DTRANS_CLIENT -DUNIXCONN -c -DXT_X_RELEASE=6  -O -I. -I/opt/lsb-tet3-lite/inc/tet3 -I/nethome/autobuild/tmp/rpm-build/BUILD/lsb-test-xts5-5.1.5/xts5/src/lib -I/nethome/autobuild/tmp/rpm-build/BUILD/lsb-test-xts5-5.1.5/xts5/src/lib/X11 -I/nethome/autobuild/tmp/rpm-build/BUILD/lsb-test-xts5-5.1.5/xts5/include -DXTESTEXTENSION -DINPUTEXTENSION Command.c
lsbcc -DX11_t -DTRANS_CLIENT -DUNIXCONN -c -DXT_X_RELEASE=6  -O -I. -I/opt/lsb-tet3-lite/inc/tet3 -I/nethome/autobuild/tmp/rpm-build/BUILD/lsb-test-xts5-5.1.5/xts5/src/lib -I/nethome/autobuild/tmp/rpm-build/BUILD/lsb-test-xts5-5.1.5/xts5/src/lib/X11 -I/nethome/autobuild/tmp/rpm-build/BUILD/lsb-test-xts5-5.1.5/xts5/include -DXTESTEXTENSION -DINPUTEXTENSION Form.c
lsbcc -DX11_t -DTRANS_CLIENT -DUNIXCONN -c -DXT_X_RELEASE=6  -O -I. -I/opt/lsb-tet3-lite/inc/tet3 -I/nethome/autobuild/tmp/rpm-build/BUILD/lsb-test-xts5-5.1.5/xts5/src/lib -I/nethome/autobuild/tmp/rpm-build/BUILD/lsb-test-xts5-5.1.5/xts5/src/lib/X11 -I/nethome/autobuild/tmp/rpm-build/BUILD/lsb-test-xts5-5.1.5/xts5/include -DXTESTEXTENSION -DINPUTEXTENSION Label.c
lsbcc -DX11_t -DTRANS_CLIENT -DUNIXCONN -c -DXT_X_RELEASE=6  -O -I. -I/opt/lsb-tet3-lite/inc/tet3 -I/nethome/autobuild/tmp/rpm-build/BUILD/lsb-test-xts5-5.1.5/xts5/src/lib -I/nethome/autobuild/tmp/rpm-build/BUILD/lsb-test-xts5-5.1.5/xts5/src/lib/X11 -I/nethome/autobuild/tmp/rpm-build/BUILD/lsb-test-xts5-5.1.5/xts5/include -DXTESTEXTENSION -DINPUTEXTENSION Paned.c
lsbcc -DX11_t -DTRANS_CLIENT -DUNIXCONN -c -DXT_X_RELEASE=6  -O -I. -I/opt/lsb-tet3-lite/inc/tet3 -I/nethome/autobuild/tmp/rpm-build/BUILD/lsb-test-xts5-5.1.5/xts5/src/lib -I/nethome/autobuild/tmp/rpm-build/BUILD/lsb-test-xts5-5.1.5/xts5/src/lib/X11 -I/nethome/autobuild/tmp/rpm-build/BUILD/lsb-test-xts5-5.1.5/xts5/include -DXTESTEXTENSION -DINPUTEXTENSION Tree.c
lsbcc -DX11_t -DTRANS_CLIENT -DUNIXCONN -c -DXT_X_RELEASE=6  -O -I. -I/opt/lsb-tet3-lite/inc/tet3 -I/nethome/autobuild/tmp/rpm-build/BUILD/lsb-test-xts5-5.1.5/xts5/src/lib -I/nethome/autobuild/tmp/rpm-build/BUILD/lsb-test-xts5-5.1.5/xts5/src/lib/X11 -I/nethome/autobuild/tmp/rpm-build/BUILD/lsb-test-xts5-5.1.5/xts5/include -DXTESTEXTENSION -DINPUTEXTENSION Viewport.c
Viewport.c: In function ‘CreateScrollbar’:
Viewport.c:193: warning: initialization makes integer from pointer without a cast
Viewport.c:194: warning: initialization makes integer from pointer without a cast
Viewport.c:195: warning: initialization makes integer from pointer without a cast
Viewport.c:196: warning: initialization makes integer from pointer without a cast
Viewport.c:197: warning: initialization makes integer from pointer without a cast
Viewport.c:198: warning: initialization makes integer from pointer without a cast
lsbcc -DX11_t -DTRANS_CLIENT -DUNIXCONN -c -DXT_X_RELEASE=6  -O -I. -I/opt/lsb-tet3-lite/inc/tet3 -I/nethome/autobuild/tmp/rpm-build/BUILD/lsb-test-xts5-5.1.5/xts5/src/lib -I/nethome/autobuild/tmp/rpm-build/BUILD/lsb-test-xts5-5.1.5/xts5/src/lib/X11 -I/nethome/autobuild/tmp/rpm-build/BUILD/lsb-test-xts5-5.1.5/xts5/include -DXTESTEXTENSION -DINPUTEXTENSION Scrollbar.c
lsbcc -DX11_t -DTRANS_CLIENT -DUNIXCONN -c -DXT_X_RELEASE=6  -O -I. -I/opt/lsb-tet3-lite/inc/tet3 -I/nethome/autobuild/tmp/rpm-build/BUILD/lsb-test-xts5-5.1.5/xts5/src/lib -I/nethome/autobuild/tmp/rpm-build/BUILD/lsb-test-xts5-5.1.5/xts5/src/lib/X11 -I/nethome/autobuild/tmp/rpm-build/BUILD/lsb-test-xts5-5.1.5/xts5/include -DXTESTEXTENSION -DINPUTEXTENSION Sme.c
lsbcc -DX11_t -DTRANS_CLIENT -DUNIXCONN -c -DXT_X_RELEASE=6  -O -I. -I/opt/lsb-tet3-lite/inc/tet3 -I/nethome/autobuild/tmp/rpm-build/BUILD/lsb-test-xts5-5.1.5/xts5/src/lib -I/nethome/autobuild/tmp/rpm-build/BUILD/lsb-test-xts5-5.1.5/xts5/src/lib/X11 -I/nethome/autobuild/tmp/rpm-build/BUILD/lsb-test-xts5-5.1.5/xts5/include -DXTESTEXTENSION -DINPUTEXTENSION SmeBSB.c
lsbcc -DX11_t -DTRANS_CLIENT -DUNIXCONN -c -DXT_X_RELEASE=6  -O -I. -I/opt/lsb-tet3-lite/inc/tet3 -I/nethome/autobuild/tmp/rpm-build/BUILD/lsb-test-xts5-5.1.5/xts5/src/lib -I/nethome/autobuild/tmp/rpm-build/BUILD/lsb-test-xts5-5.1.5/xts5/src/lib/X11 -I/nethome/autobuild/tmp/rpm-build/BUILD/lsb-test-xts5-5.1.5/xts5/include -DXTESTEXTENSION -DINPUTEXTENSION Simple.c
lsbcc -DX11_t -DTRANS_CLIENT -DUNIXCONN -c -DXT_X_RELEASE=6  -O -I. -I/opt/lsb-tet3-lite/inc/tet3 -I/nethome/autobuild/tmp/rpm-build/BUILD/lsb-test-xts5-5.1.5/xts5/src/lib -I/nethome/autobuild/tmp/rpm-build/BUILD/lsb-test-xts5-5.1.5/xts5/src/lib/X11 -I/nethome/autobuild/tmp/rpm-build/BUILD/lsb-test-xts5-5.1.5/xts5/include -DXTESTEXTENSION -DINPUTEXTENSION SimpleMenu.c
SimpleMenu.c:116:1: warning: "ForAllChildren" redefined
In file included from SimpleMenu.c:105:
/nethome/autobuild/tmp/rpm-build/BUILD/lsb-test-xts5-5.1.5/xts5/include/X11/Xaw/SimpleMenP.h:102:1: warning: this is the location of the previous definition
lsbcc -DX11_t -DTRANS_CLIENT -DUNIXCONN -c -DXT_X_RELEASE=6  -O -I. -I/opt/lsb-tet3-lite/inc/tet3 -I/nethome/autobuild/tmp/rpm-build/BUILD/lsb-test-xts5-5.1.5/xts5/src/lib -I/nethome/autobuild/tmp/rpm-build/BUILD/lsb-test-xts5-5.1.5/xts5/src/lib/X11 -I/nethome/autobuild/tmp/rpm-build/BUILD/lsb-test-xts5-5.1.5/xts5/include -DXTESTEXTENSION -DINPUTEXTENSION Grip.c
lsbcc -DX11_t -DTRANS_CLIENT -DUNIXCONN -c -DXT_X_RELEASE=6  -O -I. -I/opt/lsb-tet3-lite/inc/tet3 -I/nethome/autobuild/tmp/rpm-build/BUILD/lsb-test-xts5-5.1.5/xts5/src/lib -I/nethome/autobuild/tmp/rpm-build/BUILD/lsb-test-xts5-5.1.5/xts5/src/lib/X11 -I/nethome/autobuild/tmp/rpm-build/BUILD/lsb-test-xts5-5.1.5/xts5/include -DXTESTEXTENSION -DINPUTEXTENSION XawInit.c
: ranlib libXtaw.a
cp libXtaw.a /nethome/autobuild/tmp/rpm-build/BUILD/lsb-test-xts5-5.1.5/xts5/lib
make[2]: Leaving directory `/nethome/autobuild/tmp/rpm-build/BUILD/lsb-test-xts5-5.1.5/xts5/src/libXtaw'
Building libXtmu
make[2]: Entering directory `/nethome/autobuild/tmp/rpm-build/BUILD/lsb-test-xts5-5.1.5/xts5/src/libXtmu'
lsbcc -DX11_t -DTRANS_CLIENT -DUNIXCONN -c -DXT_X_RELEASE=6  -O -I. -I/opt/lsb-tet3-lite/inc/tet3 -I/nethome/autobuild/tmp/rpm-build/BUILD/lsb-test-xts5-5.1.5/xts5/src/lib -I/nethome/autobuild/tmp/rpm-build/BUILD/lsb-test-xts5-5.1.5/xts5/src/lib/X11 -I/nethome/autobuild/tmp/rpm-build/BUILD/lsb-test-xts5-5.1.5/xts5/include -DXTESTEXTENSION -DINPUTEXTENSION Initer.c
lsbcc -DX11_t -DTRANS_CLIENT -DUNIXCONN -c -DXT_X_RELEASE=6  -O -I. -I/opt/lsb-tet3-lite/inc/tet3 -I/nethome/autobuild/tmp/rpm-build/BUILD/lsb-test-xts5-5.1.5/xts5/src/lib -I/nethome/autobuild/tmp/rpm-build/BUILD/lsb-test-xts5-5.1.5/xts5/src/lib/X11 -I/nethome/autobuild/tmp/rpm-build/BUILD/lsb-test-xts5-5.1.5/xts5/include -DXTESTEXTENSION -DINPUTEXTENSION StrToShap.c
lsbcc -DX11_t -DTRANS_CLIENT -DUNIXCONN -c -DXT_X_RELEASE=6  -O -I. -I/opt/lsb-tet3-lite/inc/tet3 -I/nethome/autobuild/tmp/rpm-build/BUILD/lsb-test-xts5-5.1.5/xts5/src/lib -I/nethome/autobuild/tmp/rpm-build/BUILD/lsb-test-xts5-5.1.5/xts5/src/lib/X11 -I/nethome/autobuild/tmp/rpm-build/BUILD/lsb-test-xts5-5.1.5/xts5/include -DXTESTEXTENSION -DINPUTEXTENSION StrToJust.c
lsbcc -DX11_t -DTRANS_CLIENT -DUNIXCONN -c -DXT_X_RELEASE=6  -O -I. -I/opt/lsb-tet3-lite/inc/tet3 -I/nethome/autobuild/tmp/rpm-build/BUILD/lsb-test-xts5-5.1.5/xts5/src/lib -I/nethome/autobuild/tmp/rpm-build/BUILD/lsb-test-xts5-5.1.5/xts5/src/lib/X11 -I/nethome/autobuild/tmp/rpm-build/BUILD/lsb-test-xts5-5.1.5/xts5/include -DXTESTEXTENSION -DINPUTEXTENSION ShapeWidg.c
lsbcc -DX11_t -DTRANS_CLIENT -DUNIXCONN -c -DXT_X_RELEASE=6  -O -I. -I/opt/lsb-tet3-lite/inc/tet3 -I/nethome/autobuild/tmp/rpm-build/BUILD/lsb-test-xts5-5.1.5/xts5/src/lib -I/nethome/autobuild/tmp/rpm-build/BUILD/lsb-test-xts5-5.1.5/xts5/src/lib/X11 -I/nethome/autobuild/tmp/rpm-build/BUILD/lsb-test-xts5-5.1.5/xts5/include -DXTESTEXTENSION -DINPUTEXTENSION GrayPixmap.c
lsbcc -DX11_t -DTRANS_CLIENT -DUNIXCONN -c -DXT_X_RELEASE=6  -O -I. -I/opt/lsb-tet3-lite/inc/tet3 -I/nethome/autobuild/tmp/rpm-build/BUILD/lsb-test-xts5-5.1.5/xts5/src/lib -I/nethome/autobuild/tmp/rpm-build/BUILD/lsb-test-xts5-5.1.5/xts5/src/lib/X11 -I/nethome/autobuild/tmp/rpm-build/BUILD/lsb-test-xts5-5.1.5/xts5/include -DXTESTEXTENSION -DINPUTEXTENSION StrToWidg.c
lsbcc -DX11_t -DTRANS_CLIENT -DUNIXCONN -c -DXT_X_RELEASE=6  -O -I. -I/opt/lsb-tet3-lite/inc/tet3 -I/nethome/autobuild/tmp/rpm-build/BUILD/lsb-test-xts5-5.1.5/xts5/src/lib -I/nethome/autobuild/tmp/rpm-build/BUILD/lsb-test-xts5-5.1.5/xts5/src/lib/X11 -I/nethome/autobuild/tmp/rpm-build/BUILD/lsb-test-xts5-5.1.5/xts5/include -DXTESTEXTENSION -DINPUTEXTENSION StrToCurs.c
lsbcc -DX11_t -DTRANS_CLIENT -DUNIXCONN -c -DXT_X_RELEASE=6  -O -I. -I/opt/lsb-tet3-lite/inc/tet3 -I/nethome/autobuild/tmp/rpm-build/BUILD/lsb-test-xts5-5.1.5/xts5/src/lib -I/nethome/autobuild/tmp/rpm-build/BUILD/lsb-test-xts5-5.1.5/xts5/src/lib/X11 -I/nethome/autobuild/tmp/rpm-build/BUILD/lsb-test-xts5-5.1.5/xts5/include -DXTESTEXTENSION -DINPUTEXTENSION Lower.c
lsbcc -DX11_t -DTRANS_CLIENT -DUNIXCONN -c -DXT_X_RELEASE=6  -O -I. -I/opt/lsb-tet3-lite/inc/tet3 -I/nethome/autobuild/tmp/rpm-build/BUILD/lsb-test-xts5-5.1.5/xts5/src/lib -I/nethome/autobuild/tmp/rpm-build/BUILD/lsb-test-xts5-5.1.5/xts5/src/lib/X11 -I/nethome/autobuild/tmp/rpm-build/BUILD/lsb-test-xts5-5.1.5/xts5/include -DXTESTEXTENSION -DINPUTEXTENSION DrRndRect.c
lsbcc -DX11_t -DTRANS_CLIENT -DUNIXCONN -c -DXT_X_RELEASE=6  -O -I. -I/opt/lsb-tet3-lite/inc/tet3 -I/nethome/autobuild/tmp/rpm-build/BUILD/lsb-test-xts5-5.1.5/xts5/src/lib -I/nethome/autobuild/tmp/rpm-build/BUILD/lsb-test-xts5-5.1.5/xts5/src/lib/X11 -I/nethome/autobuild/tmp/rpm-build/BUILD/lsb-test-xts5-5.1.5/xts5/include -DXTESTEXTENSION -DINPUTEXTENSION LocBitmap.c
lsbcc -DX11_t -DTRANS_CLIENT -DUNIXCONN -c -DXT_X_RELEASE=6  -O -I. -I/opt/lsb-tet3-lite/inc/tet3 -I/nethome/autobuild/tmp/rpm-build/BUILD/lsb-test-xts5-5.1.5/xts5/src/lib -I/nethome/autobuild/tmp/rpm-build/BUILD/lsb-test-xts5-5.1.5/xts5/src/lib/X11 -I/nethome/autobuild/tmp/rpm-build/BUILD/lsb-test-xts5-5.1.5/xts5/include -DXTESTEXTENSION -DINPUTEXTENSION CursorName.c
lsbcc -DX11_t -DTRANS_CLIENT -DUNIXCONN -c -DXT_X_RELEASE=6  -O -I. -I/opt/lsb-tet3-lite/inc/tet3 -I/nethome/autobuild/tmp/rpm-build/BUILD/lsb-test-xts5-5.1.5/xts5/src/lib -I/nethome/autobuild/tmp/rpm-build/BUILD/lsb-test-xts5-5.1.5/xts5/src/lib/X11 -I/nethome/autobuild/tmp/rpm-build/BUILD/lsb-test-xts5-5.1.5/xts5/include -DXTESTEXTENSION -DINPUTEXTENSION CvtCache.c
lsbcc -DX11_t -DTRANS_CLIENT -DUNIXCONN -c -DXT_X_RELEASE=6  -O -I. -I/opt/lsb-tet3-lite/inc/tet3 -I/nethome/autobuild/tmp/rpm-build/BUILD/lsb-test-xts5-5.1.5/xts5/src/lib -I/nethome/autobuild/tmp/rpm-build/BUILD/lsb-test-xts5-5.1.5/xts5/src/lib/X11 -I/nethome/autobuild/tmp/rpm-build/BUILD/lsb-test-xts5-5.1.5/xts5/include -DXTESTEXTENSION -DINPUTEXTENSION RdBitF.c
lsbcc -DX11_t -DTRANS_CLIENT -DUNIXCONN -c -DXT_X_RELEASE=6  -O -I. -I/opt/lsb-tet3-lite/inc/tet3 -I/nethome/autobuild/tmp/rpm-build/BUILD/lsb-test-xts5-5.1.5/xts5/src/lib -I/nethome/autobuild/tmp/rpm-build/BUILD/lsb-test-xts5-5.1.5/xts5/src/lib/X11 -I/nethome/autobuild/tmp/rpm-build/BUILD/lsb-test-xts5-5.1.5/xts5/include -DXTESTEXTENSION -DINPUTEXTENSION DisplayQue.c
lsbcc -DX11_t -DTRANS_CLIENT -DUNIXCONN -c -DXT_X_RELEASE=6  -O -I. -I/opt/lsb-tet3-lite/inc/tet3 -I/nethome/autobuild/tmp/rpm-build/BUILD/lsb-test-xts5-5.1.5/xts5/src/lib -I/nethome/autobuild/tmp/rpm-build/BUILD/lsb-test-xts5-5.1.5/xts5/src/lib/X11 -I/nethome/autobuild/tmp/rpm-build/BUILD/lsb-test-xts5-5.1.5/xts5/include -DXTESTEXTENSION -DINPUTEXTENSION CloseHook.c
lsbcc -DX11_t -DTRANS_CLIENT -DUNIXCONN -c -DXT_X_RELEASE=6  -O -I. -I/opt/lsb-tet3-lite/inc/tet3 -I/nethome/autobuild/tmp/rpm-build/BUILD/lsb-test-xts5-5.1.5/xts5/src/lib -I/nethome/autobuild/tmp/rpm-build/BUILD/lsb-test-xts5-5.1.5/xts5/src/lib/X11 -I/nethome/autobuild/tmp/rpm-build/BUILD/lsb-test-xts5-5.1.5/xts5/include -DXTESTEXTENSION -DINPUTEXTENSION StrToOrnt.c
lsbcc -DX11_t -DTRANS_CLIENT -DUNIXCONN -c -DXT_X_RELEASE=6  -O -I. -I/opt/lsb-tet3-lite/inc/tet3 -I/nethome/autobuild/tmp/rpm-build/BUILD/lsb-test-xts5-5.1.5/xts5/src/lib -I/nethome/autobuild/tmp/rpm-build/BUILD/lsb-test-xts5-5.1.5/xts5/src/lib/X11 -I/nethome/autobuild/tmp/rpm-build/BUILD/lsb-test-xts5-5.1.5/xts5/include -DXTESTEXTENSION -DINPUTEXTENSION StrToBS.c
: ranlib libXtmu.a
cp libXtmu.a /nethome/autobuild/tmp/rpm-build/BUILD/lsb-test-xts5-5.1.5/xts5/lib
make[2]: Leaving directory `/nethome/autobuild/tmp/rpm-build/BUILD/lsb-test-xts5-5.1.5/xts5/src/libXtmu'
Building libXtTest
make[2]: Entering directory `/nethome/autobuild/tmp/rpm-build/BUILD/lsb-test-xts5-5.1.5/xts5/src/libXtTest'
lsbcc -DX11_t -DTRANS_CLIENT -DUNIXCONN -c -DXT_X_RELEASE=6  -O -I. -I/opt/lsb-tet3-lite/inc/tet3 -I/nethome/autobuild/tmp/rpm-build/BUILD/lsb-test-xts5-5.1.5/xts5/src/lib -I/nethome/autobuild/tmp/rpm-build/BUILD/lsb-test-xts5-5.1.5/xts5/src/lib/X11 -I/nethome/autobuild/tmp/rpm-build/BUILD/lsb-test-xts5-5.1.5/xts5/include -DNeedFunctionPrototypes=1 -DXTESTEXTENSION avs_def.c
lsbcc -DX11_t -DTRANS_CLIENT -DUNIXCONN -c -DXT_X_RELEASE=6  -O -I. -I/opt/lsb-tet3-lite/inc/tet3 -I/nethome/autobuild/tmp/rpm-build/BUILD/lsb-test-xts5-5.1.5/xts5/src/lib -I/nethome/autobuild/tmp/rpm-build/BUILD/lsb-test-xts5-5.1.5/xts5/src/lib/X11 -I/nethome/autobuild/tmp/rpm-build/BUILD/lsb-test-xts5-5.1.5/xts5/include -DNeedFunctionPrototypes=1 -DXTESTEXTENSION avs_func.c
lsbcc -DX11_t -DTRANS_CLIENT -DUNIXCONN -c -DXT_X_RELEASE=6  -O -I. -I/opt/lsb-tet3-lite/inc/tet3 -I/nethome/autobuild/tmp/rpm-build/BUILD/lsb-test-xts5-5.1.5/xts5/src/lib -I/nethome/autobuild/tmp/rpm-build/BUILD/lsb-test-xts5-5.1.5/xts5/src/lib/X11 -I/nethome/autobuild/tmp/rpm-build/BUILD/lsb-test-xts5-5.1.5/xts5/include -DNeedFunctionPrototypes=1 -DXTESTEXTENSION avs_hier.c
lsbcc -DX11_t -DTRANS_CLIENT -DUNIXCONN -c -DXT_X_RELEASE=6  -O -I. -I/opt/lsb-tet3-lite/inc/tet3 -I/nethome/autobuild/tmp/rpm-build/BUILD/lsb-test-xts5-5.1.5/xts5/src/lib -I/nethome/autobuild/tmp/rpm-build/BUILD/lsb-test-xts5-5.1.5/xts5/src/lib/X11 -I/nethome/autobuild/tmp/rpm-build/BUILD/lsb-test-xts5-5.1.5/xts5/include -DNeedFunctionPrototypes=1 -DXTESTEXTENSION avs_hierd.c
lsbcc -DX11_t -DTRANS_CLIENT -DUNIXCONN -c -DXT_X_RELEASE=6  -O -I. -I/opt/lsb-tet3-lite/inc/tet3 -I/nethome/autobuild/tmp/rpm-build/BUILD/lsb-test-xts5-5.1.5/xts5/src/lib -I/nethome/autobuild/tmp/rpm-build/BUILD/lsb-test-xts5-5.1.5/xts5/src/lib/X11 -I/nethome/autobuild/tmp/rpm-build/BUILD/lsb-test-xts5-5.1.5/xts5/include -DNeedFunctionPrototypes=1 -DXTESTEXTENSION avs_init.c
lsbcc -DX11_t -DTRANS_CLIENT -DUNIXCONN -c -DXT_X_RELEASE=6  -O -I. -I/opt/lsb-tet3-lite/inc/tet3 -I/nethome/autobuild/tmp/rpm-build/BUILD/lsb-test-xts5-5.1.5/xts5/src/lib -I/nethome/autobuild/tmp/rpm-build/BUILD/lsb-test-xts5-5.1.5/xts5/src/lib/X11 -I/nethome/autobuild/tmp/rpm-build/BUILD/lsb-test-xts5-5.1.5/xts5/include -DNeedFunctionPrototypes=1 -DXTESTEXTENSION avs_tree.c
lsbcc -DX11_t -DTRANS_CLIENT -DUNIXCONN -c -DXT_X_RELEASE=6  -O -I. -I/opt/lsb-tet3-lite/inc/tet3 -I/nethome/autobuild/tmp/rpm-build/BUILD/lsb-test-xts5-5.1.5/xts5/src/lib -I/nethome/autobuild/tmp/rpm-build/BUILD/lsb-test-xts5-5.1.5/xts5/src/lib/X11 -I/nethome/autobuild/tmp/rpm-build/BUILD/lsb-test-xts5-5.1.5/xts5/include -DNeedFunctionPrototypes=1 -DXTESTEXTENSION avs_widget.c
lsbcc -DX11_t -DTRANS_CLIENT -DUNIXCONN -c -DXT_X_RELEASE=6  -O -I. -I/opt/lsb-tet3-lite/inc/tet3 -I/nethome/autobuild/tmp/rpm-build/BUILD/lsb-test-xts5-5.1.5/xts5/src/lib -I/nethome/autobuild/tmp/rpm-build/BUILD/lsb-test-xts5-5.1.5/xts5/src/lib/X11 -I/nethome/autobuild/tmp/rpm-build/BUILD/lsb-test-xts5-5.1.5/xts5/include -DNeedFunctionPrototypes=1 -DXTESTEXTENSION avs_xext.c
lsbcc -DX11_t -DTRANS_CLIENT -DUNIXCONN -c -DXT_X_RELEASE=6  -O -I. -I/opt/lsb-tet3-lite/inc/tet3 -I/nethome/autobuild/tmp/rpm-build/BUILD/lsb-test-xts5-5.1.5/xts5/src/lib -I/nethome/autobuild/tmp/rpm-build/BUILD/lsb-test-xts5-5.1.5/xts5/src/lib/X11 -I/nethome/autobuild/tmp/rpm-build/BUILD/lsb-test-xts5-5.1.5/xts5/include -DNeedFunctionPrototypes=1 -DXTESTEXTENSION AvsComp.c
lsbcc -DX11_t -DTRANS_CLIENT -DUNIXCONN -c -DXT_X_RELEASE=6  -O -I. -I/opt/lsb-tet3-lite/inc/tet3 -I/nethome/autobuild/tmp/rpm-build/BUILD/lsb-test-xts5-5.1.5/xts5/src/lib -I/nethome/autobuild/tmp/rpm-build/BUILD/lsb-test-xts5-5.1.5/xts5/src/lib/X11 -I/nethome/autobuild/tmp/rpm-build/BUILD/lsb-test-xts5-5.1.5/xts5/include -DNeedFunctionPrototypes=1 -DXTESTEXTENSION AvsComp2.c
lsbcc -DX11_t -DTRANS_CLIENT -DUNIXCONN -c -DXT_X_RELEASE=6  -O -I. -I/opt/lsb-tet3-lite/inc/tet3 -I/nethome/autobuild/tmp/rpm-build/BUILD/lsb-test-xts5-5.1.5/xts5/src/lib -I/nethome/autobuild/tmp/rpm-build/BUILD/lsb-test-xts5-5.1.5/xts5/src/lib/X11 -I/nethome/autobuild/tmp/rpm-build/BUILD/lsb-test-xts5-5.1.5/xts5/include -DNeedFunctionPrototypes=1 -DXTESTEXTENSION AvsForm.c
lsbcc -DX11_t -DTRANS_CLIENT -DUNIXCONN -c -DXT_X_RELEASE=6  -O -I. -I/opt/lsb-tet3-lite/inc/tet3 -I/nethome/autobuild/tmp/rpm-build/BUILD/lsb-test-xts5-5.1.5/xts5/src/lib -I/nethome/autobuild/tmp/rpm-build/BUILD/lsb-test-xts5-5.1.5/xts5/src/lib/X11 -I/nethome/autobuild/tmp/rpm-build/BUILD/lsb-test-xts5-5.1.5/xts5/include -DNeedFunctionPrototypes=1 -DXTESTEXTENSION AvsForm2.c
lsbcc -DX11_t -DTRANS_CLIENT -DUNIXCONN -c -DXT_X_RELEASE=6  -O -I. -I/opt/lsb-tet3-lite/inc/tet3 -I/nethome/autobuild/tmp/rpm-build/BUILD/lsb-test-xts5-5.1.5/xts5/src/lib -I/nethome/autobuild/tmp/rpm-build/BUILD/lsb-test-xts5-5.1.5/xts5/src/lib/X11 -I/nethome/autobuild/tmp/rpm-build/BUILD/lsb-test-xts5-5.1.5/xts5/include -DNeedFunctionPrototypes=1 -DXTESTEXTENSION AvsForm3.c
lsbcc -DX11_t -DTRANS_CLIENT -DUNIXCONN -c -DXT_X_RELEASE=6  -O -I. -I/opt/lsb-tet3-lite/inc/tet3 -I/nethome/autobuild/tmp/rpm-build/BUILD/lsb-test-xts5-5.1.5/xts5/src/lib -I/nethome/autobuild/tmp/rpm-build/BUILD/lsb-test-xts5-5.1.5/xts5/src/lib/X11 -I/nethome/autobuild/tmp/rpm-build/BUILD/lsb-test-xts5-5.1.5/xts5/include -DNeedFunctionPrototypes=1 -DXTESTEXTENSION AvsRectObj.c
lsbcc -DX11_t -DTRANS_CLIENT -DUNIXCONN -c -DXT_X_RELEASE=6  -O -I. -I/opt/lsb-tet3-lite/inc/tet3 -I/nethome/autobuild/tmp/rpm-build/BUILD/lsb-test-xts5-5.1.5/xts5/src/lib -I/nethome/autobuild/tmp/rpm-build/BUILD/lsb-test-xts5-5.1.5/xts5/src/lib/X11 -I/nethome/autobuild/tmp/rpm-build/BUILD/lsb-test-xts5-5.1.5/xts5/include -DNeedFunctionPrototypes=1 -DXTESTEXTENSION AvsWid.c
lsbcc -DX11_t -DTRANS_CLIENT -DUNIXCONN -c -DXT_X_RELEASE=6  -O -I. -I/opt/lsb-tet3-lite/inc/tet3 -I/nethome/autobuild/tmp/rpm-build/BUILD/lsb-test-xts5-5.1.5/xts5/src/lib -I/nethome/autobuild/tmp/rpm-build/BUILD/lsb-test-xts5-5.1.5/xts5/src/lib/X11 -I/nethome/autobuild/tmp/rpm-build/BUILD/lsb-test-xts5-5.1.5/xts5/include -DNeedFunctionPrototypes=1 -DXTESTEXTENSION AvsObj.c
lsbcc -DX11_t -DTRANS_CLIENT -DUNIXCONN -c -DXT_X_RELEASE=6  -O -I. -I/opt/lsb-tet3-lite/inc/tet3 -I/nethome/autobuild/tmp/rpm-build/BUILD/lsb-test-xts5-5.1.5/xts5/src/lib -I/nethome/autobuild/tmp/rpm-build/BUILD/lsb-test-xts5-5.1.5/xts5/src/lib/X11 -I/nethome/autobuild/tmp/rpm-build/BUILD/lsb-test-xts5-5.1.5/xts5/include -DNeedFunctionPrototypes=1 -DXTESTEXTENSION check.c
lsbcc -DX11_t -DTRANS_CLIENT -DUNIXCONN -c -DXT_X_RELEASE=6  -O -I. -I/opt/lsb-tet3-lite/inc/tet3 -I/nethome/autobuild/tmp/rpm-build/BUILD/lsb-test-xts5-5.1.5/xts5/src/lib -I/nethome/autobuild/tmp/rpm-build/BUILD/lsb-test-xts5-5.1.5/xts5/src/lib/X11 -I/nethome/autobuild/tmp/rpm-build/BUILD/lsb-test-xts5-5.1.5/xts5/include -DNeedFunctionPrototypes=1 -DXTESTEXTENSION eventname.c
lsbcc -DX11_t -DTRANS_CLIENT -DUNIXCONN -c -DXT_X_RELEASE=6  -O -I. -I/opt/lsb-tet3-lite/inc/tet3 -I/nethome/autobuild/tmp/rpm-build/BUILD/lsb-test-xts5-5.1.5/xts5/src/lib -I/nethome/autobuild/tmp/rpm-build/BUILD/lsb-test-xts5-5.1.5/xts5/src/lib/X11 -I/nethome/autobuild/tmp/rpm-build/BUILD/lsb-test-xts5-5.1.5/xts5/include -DNeedFunctionPrototypes=1 -DXTESTEXTENSION sendevent.c
lsbcc -DX11_t -DTRANS_CLIENT -DUNIXCONN -c -DXT_X_RELEASE=6  -O -I. -I/opt/lsb-tet3-lite/inc/tet3 -I/nethome/autobuild/tmp/rpm-build/BUILD/lsb-test-xts5-5.1.5/xts5/src/lib -I/nethome/autobuild/tmp/rpm-build/BUILD/lsb-test-xts5-5.1.5/xts5/src/lib/X11 -I/nethome/autobuild/tmp/rpm-build/BUILD/lsb-test-xts5-5.1.5/xts5/include -DNeedFunctionPrototypes=1 -DXTESTEXTENSION sendmask.c
lsbcc -DX11_t -DTRANS_CLIENT -DUNIXCONN -c -DXT_X_RELEASE=6  -O -I. -I/opt/lsb-tet3-lite/inc/tet3 -I/nethome/autobuild/tmp/rpm-build/BUILD/lsb-test-xts5-5.1.5/xts5/src/lib -I/nethome/autobuild/tmp/rpm-build/BUILD/lsb-test-xts5-5.1.5/xts5/src/lib/X11 -I/nethome/autobuild/tmp/rpm-build/BUILD/lsb-test-xts5-5.1.5/xts5/include -DNeedFunctionPrototypes=1 -DXTESTEXTENSION xhandler.c
lsbcc -DX11_t -DTRANS_CLIENT -DUNIXCONN -c -DXT_X_RELEASE=6  -O -I. -I/opt/lsb-tet3-lite/inc/tet3 -I/nethome/autobuild/tmp/rpm-build/BUILD/lsb-test-xts5-5.1.5/xts5/src/lib -I/nethome/autobuild/tmp/rpm-build/BUILD/lsb-test-xts5-5.1.5/xts5/src/lib/X11 -I/nethome/autobuild/tmp/rpm-build/BUILD/lsb-test-xts5-5.1.5/xts5/include -DNeedFunctionPrototypes=1 -DXTESTEXTENSION xthandler.c
lsbcc -DX11_t -DTRANS_CLIENT -DUNIXCONN -c -DXT_X_RELEASE=6  -O -I. -I/opt/lsb-tet3-lite/inc/tet3 -I/nethome/autobuild/tmp/rpm-build/BUILD/lsb-test-xts5-5.1.5/xts5/src/lib -I/nethome/autobuild/tmp/rpm-build/BUILD/lsb-test-xts5-5.1.5/xts5/src/lib/X11 -I/nethome/autobuild/tmp/rpm-build/BUILD/lsb-test-xts5-5.1.5/xts5/include -DNeedFunctionPrototypes=1 -DXTESTEXTENSION xunexperr.c
lsbcc -DX11_t -DTRANS_CLIENT -DUNIXCONN -c -DXT_X_RELEASE=6  -O -I. -I/opt/lsb-tet3-lite/inc/tet3 -I/nethome/autobuild/tmp/rpm-build/BUILD/lsb-test-xts5-5.1.5/xts5/src/lib -I/nethome/autobuild/tmp/rpm-build/BUILD/lsb-test-xts5-5.1.5/xts5/src/lib/X11 -I/nethome/autobuild/tmp/rpm-build/BUILD/lsb-test-xts5-5.1.5/xts5/include -DNeedFunctionPrototypes=1 -DXTESTEXTENSION errlook.c
lsbcc -DX11_t -DTRANS_CLIENT -DUNIXCONN -c -DXT_X_RELEASE=6  -O -I. -I/opt/lsb-tet3-lite/inc/tet3 -I/nethome/autobuild/tmp/rpm-build/BUILD/lsb-test-xts5-5.1.5/xts5/src/lib -I/nethome/autobuild/tmp/rpm-build/BUILD/lsb-test-xts5-5.1.5/xts5/src/lib/X11 -I/nethome/autobuild/tmp/rpm-build/BUILD/lsb-test-xts5-5.1.5/xts5/include -DNeedFunctionPrototypes=1 -DXTESTEXTENSION event.c
lsbcc -DX11_t -DTRANS_CLIENT -DUNIXCONN -c -DXT_X_RELEASE=6  -O -I. -I/opt/lsb-tet3-lite/inc/tet3 -I/nethome/autobuild/tmp/rpm-build/BUILD/lsb-test-xts5-5.1.5/xts5/src/lib -I/nethome/autobuild/tmp/rpm-build/BUILD/lsb-test-xts5-5.1.5/xts5/src/lib/X11 -I/nethome/autobuild/tmp/rpm-build/BUILD/lsb-test-xts5-5.1.5/xts5/include -DNeedFunctionPrototypes=1 -DXTESTEXTENSION misc.c
lsbcc -DX11_t -DTRANS_CLIENT -DUNIXCONN -c -DXT_X_RELEASE=6  -O -I. -I/opt/lsb-tet3-lite/inc/tet3 -I/nethome/autobuild/tmp/rpm-build/BUILD/lsb-test-xts5-5.1.5/xts5/src/lib -I/nethome/autobuild/tmp/rpm-build/BUILD/lsb-test-xts5-5.1.5/xts5/src/lib/X11 -I/nethome/autobuild/tmp/rpm-build/BUILD/lsb-test-xts5-5.1.5/xts5/include -DNeedFunctionPrototypes=1 -DXTESTEXTENSION pshpop.c
lsbcc -DX11_t -DTRANS_CLIENT -DUNIXCONN -c -DXT_X_RELEASE=6  -O -I. -I/opt/lsb-tet3-lite/inc/tet3 -I/nethome/autobuild/tmp/rpm-build/BUILD/lsb-test-xts5-5.1.5/xts5/src/lib -I/nethome/autobuild/tmp/rpm-build/BUILD/lsb-test-xts5-5.1.5/xts5/src/lib/X11 -I/nethome/autobuild/tmp/rpm-build/BUILD/lsb-test-xts5-5.1.5/xts5/include -DNeedFunctionPrototypes=1 -DXTESTEXTENSION signals.c
lsbcc -DX11_t -DTRANS_CLIENT -DUNIXCONN -c -DXT_X_RELEASE=6  -O -I. -I/opt/lsb-tet3-lite/inc/tet3 -I/nethome/autobuild/tmp/rpm-build/BUILD/lsb-test-xts5-5.1.5/xts5/src/lib -I/nethome/autobuild/tmp/rpm-build/BUILD/lsb-test-xts5-5.1.5/xts5/src/lib/X11 -I/nethome/autobuild/tmp/rpm-build/BUILD/lsb-test-xts5-5.1.5/xts5/include -DNeedFunctionPrototypes=1 -DXTESTEXTENSION waitfor.c
: ranlib libXtTest.a
cp libXtTest.a /nethome/autobuild/tmp/rpm-build/BUILD/lsb-test-xts5-5.1.5/xts5/lib
make[2]: Leaving directory `/nethome/autobuild/tmp/rpm-build/BUILD/lsb-test-xts5-5.1.5/xts5/src/libXtTest'
Building mc utility
make[2]: Entering directory `/nethome/autobuild/tmp/rpm-build/BUILD/lsb-test-xts5-5.1.5/xts5/src/bin/mc'
lsbcc -DX11_t -DTRANS_CLIENT -DUNIXCONN -DXT_X_RELEASE=6  -O -I. -I/opt/lsb-tet3-lite/inc/tet3 -I/nethome/autobuild/tmp/rpm-build/BUILD/lsb-test-xts5-5.1.5/xts5/src/lib -I/nethome/autobuild/tmp/rpm-build/BUILD/lsb-test-xts5-5.1.5/xts5/src/lib/X11 -I/nethome/autobuild/tmp/rpm-build/BUILD/lsb-test-xts5-5.1.5/xts5/include -DXTESTEXTENSION -DINPUTEXTENSION   -c -o main.o main.c
lsbcc -DX11_t -DTRANS_CLIENT -DUNIXCONN -DXT_X_RELEASE=6  -O -I. -I/opt/lsb-tet3-lite/inc/tet3 -I/nethome/autobuild/tmp/rpm-build/BUILD/lsb-test-xts5-5.1.5/xts5/src/lib -I/nethome/autobuild/tmp/rpm-build/BUILD/lsb-test-xts5-5.1.5/xts5/src/lib/X11 -I/nethome/autobuild/tmp/rpm-build/BUILD/lsb-test-xts5-5.1.5/xts5/include -DXTESTEXTENSION -DINPUTEXTENSION   -c -o sections.o sections.c
lsbcc -DX11_t -DTRANS_CLIENT -DUNIXCONN -DXT_X_RELEASE=6  -O -I. -I/opt/lsb-tet3-lite/inc/tet3 -I/nethome/autobuild/tmp/rpm-build/BUILD/lsb-test-xts5-5.1.5/xts5/src/lib -I/nethome/autobuild/tmp/rpm-build/BUILD/lsb-test-xts5-5.1.5/xts5/src/lib/X11 -I/nethome/autobuild/tmp/rpm-build/BUILD/lsb-test-xts5-5.1.5/xts5/include -DXTESTEXTENSION -DINPUTEXTENSION   -c -o files.o files.c
lsbcc -DX11_t -DTRANS_CLIENT -DUNIXCONN -DXT_X_RELEASE=6  -O -I. -I/opt/lsb-tet3-lite/inc/tet3 -I/nethome/autobuild/tmp/rpm-build/BUILD/lsb-test-xts5-5.1.5/xts5/src/lib -I/nethome/autobuild/tmp/rpm-build/BUILD/lsb-test-xts5-5.1.5/xts5/src/lib/X11 -I/nethome/autobuild/tmp/rpm-build/BUILD/lsb-test-xts5-5.1.5/xts5/include -DXTESTEXTENSION -DINPUTEXTENSION   -c -o shortname.o shortname.c
lsbcc -DX11_t -DTRANS_CLIENT -DUNIXCONN -DXT_X_RELEASE=6  -O -I. -I/opt/lsb-tet3-lite/inc/tet3 -I/nethome/autobuild/tmp/rpm-build/BUILD/lsb-test-xts5-5.1.5/xts5/src/lib -I/nethome/autobuild/tmp/rpm-build/BUILD/lsb-test-xts5-5.1.5/xts5/src/lib/X11 -I/nethome/autobuild/tmp/rpm-build/BUILD/lsb-test-xts5-5.1.5/xts5/include -DXTESTEXTENSION -DINPUTEXTENSION   -c -o error.o error.c
lsbcc -DX11_t -DTRANS_CLIENT -DUNIXCONN -DXT_X_RELEASE=6  -O -I. -I/opt/lsb-tet3-lite/inc/tet3 -I/nethome/autobuild/tmp/rpm-build/BUILD/lsb-test-xts5-5.1.5/xts5/src/lib -I/nethome/autobuild/tmp/rpm-build/BUILD/lsb-test-xts5-5.1.5/xts5/src/lib/X11 -I/nethome/autobuild/tmp/rpm-build/BUILD/lsb-test-xts5-5.1.5/xts5/include -DXTESTEXTENSION -DINPUTEXTENSION   -c -o gccomps.o gccomps.c
lsbcc -DX11_t -DTRANS_CLIENT -DUNIXCONN -DXT_X_RELEASE=6  -O -I. -I/opt/lsb-tet3-lite/inc/tet3 -I/nethome/autobuild/tmp/rpm-build/BUILD/lsb-test-xts5-5.1.5/xts5/src/lib -I/nethome/autobuild/tmp/rpm-build/BUILD/lsb-test-xts5-5.1.5/xts5/src/lib/X11 -I/nethome/autobuild/tmp/rpm-build/BUILD/lsb-test-xts5-5.1.5/xts5/include -DXTESTEXTENSION -DINPUTEXTENSION   -c -o set.o set.c
lsbcc -DX11_t -DTRANS_CLIENT -DUNIXCONN -DXT_X_RELEASE=6  -O -I. -I/opt/lsb-tet3-lite/inc/tet3 -I/nethome/autobuild/tmp/rpm-build/BUILD/lsb-test-xts5-5.1.5/xts5/src/lib -I/nethome/autobuild/tmp/rpm-build/BUILD/lsb-test-xts5-5.1.5/xts5/src/lib/X11 -I/nethome/autobuild/tmp/rpm-build/BUILD/lsb-test-xts5-5.1.5/xts5/include -DXTESTEXTENSION -DINPUTEXTENSION   -c -o expand.o expand.c
lsbcc -DX11_t -DTRANS_CLIENT -DUNIXCONN -DXT_X_RELEASE=6  -O -I. -I/opt/lsb-tet3-lite/inc/tet3 -I/nethome/autobuild/tmp/rpm-build/BUILD/lsb-test-xts5-5.1.5/xts5/src/lib -I/nethome/autobuild/tmp/rpm-build/BUILD/lsb-test-xts5-5.1.5/xts5/src/lib/X11 -I/nethome/autobuild/tmp/rpm-build/BUILD/lsb-test-xts5-5.1.5/xts5/include -DXTESTEXTENSION -DINPUTEXTENSION   -c -o code.o code.c
lsbcc -DX11_t -DTRANS_CLIENT -DUNIXCONN -DXT_X_RELEASE=6  -O -I. -I/opt/lsb-tet3-lite/inc/tet3 -I/nethome/autobuild/tmp/rpm-build/BUILD/lsb-test-xts5-5.1.5/xts5/src/lib -I/nethome/autobuild/tmp/rpm-build/BUILD/lsb-test-xts5-5.1.5/xts5/src/lib/X11 -I/nethome/autobuild/tmp/rpm-build/BUILD/lsb-test-xts5-5.1.5/xts5/include -DXTESTEXTENSION -DINPUTEXTENSION   -c -o make.o make.c
lsbcc -DX11_t -DTRANS_CLIENT -DUNIXCONN -DXT_X_RELEASE=6  -O -I. -I/opt/lsb-tet3-lite/inc/tet3 -I/nethome/autobuild/tmp/rpm-build/BUILD/lsb-test-xts5-5.1.5/xts5/src/lib -I/nethome/autobuild/tmp/rpm-build/BUILD/lsb-test-xts5-5.1.5/xts5/src/lib/X11 -I/nethome/autobuild/tmp/rpm-build/BUILD/lsb-test-xts5-5.1.5/xts5/include -DXTESTEXTENSION -DINPUTEXTENSION   -c -o ma.o ma.c
lsbcc -DX11_t -DTRANS_CLIENT -DUNIXCONN -DXT_X_RELEASE=6  -O -I. -I/opt/lsb-tet3-lite/inc/tet3 -I/nethome/autobuild/tmp/rpm-build/BUILD/lsb-test-xts5-5.1.5/xts5/src/lib -I/nethome/autobuild/tmp/rpm-build/BUILD/lsb-test-xts5-5.1.5/xts5/src/lib/X11 -I/nethome/autobuild/tmp/rpm-build/BUILD/lsb-test-xts5-5.1.5/xts5/include -DXTESTEXTENSION -DINPUTEXTENSION   -c -o cond.o cond.c
lsbcc -DX11_t -DTRANS_CLIENT -DUNIXCONN -DXT_X_RELEASE=6  -O -I. -I/opt/lsb-tet3-lite/inc/tet3 -I/nethome/autobuild/tmp/rpm-build/BUILD/lsb-test-xts5-5.1.5/xts5/src/lib -I/nethome/autobuild/tmp/rpm-build/BUILD/lsb-test-xts5-5.1.5/xts5/src/lib/X11 -I/nethome/autobuild/tmp/rpm-build/BUILD/lsb-test-xts5-5.1.5/xts5/include -DXTESTEXTENSION -DINPUTEXTENSION   -c -o mas.o mas.c
lsbcc -DX11_t -DTRANS_CLIENT -DUNIXCONN -L/usr/X11R6/lib -o mc main.o sections.o files.o shortname.o error.o gccomps.o set.o expand.o code.o make.o ma.o cond.o mas.o  -lXi -lXtst -lXext -lX11
rm -f /nethome/autobuild/tmp/rpm-build/BUILD/lsb-test-xts5-5.1.5/xts5/bin/mc
cp mc /nethome/autobuild/tmp/rpm-build/BUILD/lsb-test-xts5-5.1.5/xts5/bin/mc
rm -f /nethome/autobuild/tmp/rpm-build/BUILD/lsb-test-xts5-5.1.5/xts5/bin/ma /nethome/autobuild/tmp/rpm-build/BUILD/lsb-test-xts5-5.1.5/xts5/bin/mmkf /nethome/autobuild/tmp/rpm-build/BUILD/lsb-test-xts5-5.1.5/xts5/bin/mexpand
ln /nethome/autobuild/tmp/rpm-build/BUILD/lsb-test-xts5-5.1.5/xts5/bin/mc /nethome/autobuild/tmp/rpm-build/BUILD/lsb-test-xts5-5.1.5/xts5/bin/ma
ln /nethome/autobuild/tmp/rpm-build/BUILD/lsb-test-xts5-5.1.5/xts5/bin/mc /nethome/autobuild/tmp/rpm-build/BUILD/lsb-test-xts5-5.1.5/xts5/bin/mmkf
ln /nethome/autobuild/tmp/rpm-build/BUILD/lsb-test-xts5-5.1.5/xts5/bin/mc /nethome/autobuild/tmp/rpm-build/BUILD/lsb-test-xts5-5.1.5/xts5/bin/mexpand
make[2]: Leaving directory `/nethome/autobuild/tmp/rpm-build/BUILD/lsb-test-xts5-5.1.5/xts5/src/bin/mc'
Building report generators
make[2]: Entering directory `/nethome/autobuild/tmp/rpm-build/BUILD/lsb-test-xts5-5.1.5/xts5/src/bin/reports'
lsbcc -DX11_t -DTRANS_CLIENT -DUNIXCONN -DXT_X_RELEASE=6  -O -I. -I/opt/lsb-tet3-lite/inc/tet3 -I/nethome/autobuild/tmp/rpm-build/BUILD/lsb-test-xts5-5.1.5/xts5/src/lib -I/nethome/autobuild/tmp/rpm-build/BUILD/lsb-test-xts5-5.1.5/xts5/src/lib/X11 -I/nethome/autobuild/tmp/rpm-build/BUILD/lsb-test-xts5-5.1.5/xts5/include -DXTESTEXTENSION -DINPUTEXTENSION -o vswrpt vswrpt.c -L/usr/X11R6/lib -lXi -lXtst -lXext -lX11
lsbcc -DX11_t -DTRANS_CLIENT -DUNIXCONN -DXT_X_RELEASE=6  -O -I. -I/opt/lsb-tet3-lite/inc/tet3 -I/nethome/autobuild/tmp/rpm-build/BUILD/lsb-test-xts5-5.1.5/xts5/src/lib -I/nethome/autobuild/tmp/rpm-build/BUILD/lsb-test-xts5-5.1.5/xts5/src/lib/X11 -I/nethome/autobuild/tmp/rpm-build/BUILD/lsb-test-xts5-5.1.5/xts5/include -DXTESTEXTENSION -DINPUTEXTENSION -o vswrptm vswrptm.c -L/usr/X11R6/lib -lXi -lXtst -lXext -lX11
lsbcc -DX11_t -DTRANS_CLIENT -DUNIXCONN -DXT_X_RELEASE=6  -O -I. -I/opt/lsb-tet3-lite/inc/tet3 -I/nethome/autobuild/tmp/rpm-build/BUILD/lsb-test-xts5-5.1.5/xts5/src/lib -I/nethome/autobuild/tmp/rpm-build/BUILD/lsb-test-xts5-5.1.5/xts5/src/lib/X11 -I/nethome/autobuild/tmp/rpm-build/BUILD/lsb-test-xts5-5.1.5/xts5/include -DXTESTEXTENSION -DINPUTEXTENSION -o vsw_pr vsw_pr.c -L/usr/X11R6/lib -lXi -lXtst -lXext -lX11
make[2]: Leaving directory `/nethome/autobuild/tmp/rpm-build/BUILD/lsb-test-xts5-5.1.5/xts5/src/bin/reports'
Building blowup utility
make[2]: Entering directory `/nethome/autobuild/tmp/rpm-build/BUILD/lsb-test-xts5-5.1.5/xts5/src/pixval/blowup'
lsbcc -DX11_t -DTRANS_CLIENT -DUNIXCONN -DXT_X_RELEASE=6  -O -I. -I/opt/lsb-tet3-lite/inc/tet3 -I/nethome/autobuild/tmp/rpm-build/BUILD/lsb-test-xts5-5.1.5/xts5/src/lib -I/nethome/autobuild/tmp/rpm-build/BUILD/lsb-test-xts5-5.1.5/xts5/src/lib/X11 -I/nethome/autobuild/tmp/rpm-build/BUILD/lsb-test-xts5-5.1.5/xts5/include -DXTESTEXTENSION -DINPUTEXTENSION   -c -o ajax.o ajax.c
lsbcc -DX11_t -DTRANS_CLIENT -DUNIXCONN -DXT_X_RELEASE=6  -O -I. -I/opt/lsb-tet3-lite/inc/tet3 -I/nethome/autobuild/tmp/rpm-build/BUILD/lsb-test-xts5-5.1.5/xts5/src/lib -I/nethome/autobuild/tmp/rpm-build/BUILD/lsb-test-xts5-5.1.5/xts5/src/lib/X11 -I/nethome/autobuild/tmp/rpm-build/BUILD/lsb-test-xts5-5.1.5/xts5/include -DXTESTEXTENSION -DINPUTEXTENSION   -c -o vblowup_c.o vblowup_c.c
vblowup_c.c: In function ‘VBlowup’:
vblowup_c.c:529: warning: conflicting types for built-in function ‘malloc’
lsbcc -DX11_t -DTRANS_CLIENT -DUNIXCONN -L/usr/X11R6/lib -o blowup ajax.o vblowup_c.o  -lXi -lXtst -lXext -lX11 -lm
cp blowup /nethome/autobuild/tmp/rpm-build/BUILD/lsb-test-xts5-5.1.5/xts5/bin
make[2]: Leaving directory `/nethome/autobuild/tmp/rpm-build/BUILD/lsb-test-xts5-5.1.5/xts5/src/pixval/blowup'

make[1]: Leaving directory `/nethome/autobuild/tmp/rpm-build/BUILD/lsb-test-xts5-5.1.5/xts5'
make[1]: Entering directory `/nethome/autobuild/tmp/rpm-build/BUILD/lsb-test-xts5-5.1.5/xts5'
Setting 775 directory permissions
INSTALLATION OF LIBRARIES AND TOOLS COMPLETED
FONTS MUST ALSO BE INSTALLED BEFORE RUNNING TESTS
make[1]: Leaving directory `/nethome/autobuild/tmp/rpm-build/BUILD/lsb-test-xts5-5.1.5/xts5'

Harness build failed, aborting test build...
error: Bad exit status from /var/tmp/rpm-tmp.45066 (%build)


RPM build errors:
    Bad exit status from /var/tmp/rpm-tmp.45066 (%build)
expect: spawn id exp3 not open
    while executing
"expect "exit 0""
send: spawn id exp3 not open
    while executing
"send "\n""
mv: cannot stat `/nethome/autobuild/tmp/rpm-build/SRPMS/lsb-test-xts5-5.1.5-14.lsb4.src.rpm': No such file or directory
make: *** [lsb-test-xts5-5.1.5-14.lsb4.i486.rpm] Error 1


More information about the lsb-messages mailing list