[Lsb-messages] Build failure for olver-core-tests on ia64

lsb-autobuild at freestandards.org lsb-autobuild at freestandards.org
Wed Oct 8 01:54:22 PDT 2008


This is an automated message generated when a build failure occurs

Linux fsgdev-ia64 2.6.18-6-mckinley #1 SMP Mon Feb 11 11:47:35 UTC 2008 ia64 ia64 ia64 GNU/Linux
Failed to make packages for olver-core-tests
Checking build prerequisites...
Ok
Building handbook ...
make[1]: Entering directory `/nethome/autobuild/tmp/LSBauto/olver-core-tests/package/olver-core/config'
Build completed
make[1]: Leaving directory `/nethome/autobuild/tmp/LSBauto/olver-core-tests/package/olver-core/config'
Generating configuration files ...
Making default configuration "../../config/default.conf"...
Ok
Generating headers...
Ok
Done
Building test data ...
Building test data for util.dl ...             make[1]: Entering directory `/nethome/autobuild/tmp/LSBauto/olver-core-tests/package/olver-core/src/testdata/util.dl'
Build completed
make[1]: Leaving directory `/nethome/autobuild/tmp/LSBauto/olver-core-tests/package/olver-core/src/testdata/util.dl'
Installing test data for locale.nlcat ...      Done
Installing test data for locale.textdomain ... Done
Building agent ...
Checking missing LSB symbols and libraries...
missing
make[1]: Entering directory `/nethome/autobuild/tmp/LSBauto/olver-core-tests/package/olver-core/src/agent'
ERROR: Dropping argument lsbcc
common/system.c: In function 'sizeof_type_cmd':
common/system.c:283: error: 'glob64_t' undeclared (first use in this function)
common/system.c:283: error: (Each undeclared identifier is reported only once
common/system.c:283: error: for each function it appears in.)
common/system.c:305: error: 'locale_t' undeclared (first use in this function)
make[1]: *** [common/system.o] Error 1
make[1]: Leaving directory `/nethome/autobuild/tmp/LSBauto/olver-core-tests/package/olver-core/src/agent'
Building CTesk launcher ...
make[1]: Entering directory `/nethome/autobuild/tmp/LSBauto/olver-core-tests/package/olver-core/tools/CTesK/native-java-launcher'
make[1]: Nothing to be done for `all'.
make[1]: Leaving directory `/nethome/autobuild/tmp/LSBauto/olver-core-tests/package/olver-core/tools/CTesK/native-java-launcher'
Building CTesk libraries ...
make[1]: Entering directory `/nethome/autobuild/tmp/LSBauto/olver-core-tests/package/olver-core/tools/CTesK/lib/src'
make[1]: Nothing to be done for `all'.
make[1]: Leaving directory `/nethome/autobuild/tmp/LSBauto/olver-core-tests/package/olver-core/tools/CTesK/lib/src'
Building model ...
make[1]: Entering directory `/nethome/autobuild/tmp/LSBauto/olver-core-tests/package/olver-core/src/model'
Build completed
make[1]: Leaving directory `/nethome/autobuild/tmp/LSBauto/olver-core-tests/package/olver-core/src/model'

Build status for handbook .............. PASSED
Build status for configuration files ... PASSED
Build status for test data ............. PASSED
Build status for olverterm ............. FAILED
Build status for agent ................. FAILED
Build status for CTesk launcher ........ PASSED
Build status for CTesk library ......... PASSED
Build status for model ................. PASSED

Build status for OLVER ................. FAILED
make: *** [lsb-test-olver-core-1.5-1.*.rpm] Error 1


More information about the lsb-messages mailing list