[Lsb-messages] Build failure for lsbdev-cc on s390x

lsb-autobuild at freestandards.org lsb-autobuild at freestandards.org
Thu Oct 30 01:01:50 PDT 2008


This is an automated message generated when a build failure occurs

Linux l005026 2.6.16.21-0.8-default #1 SMP Mon Jul 3 18:25:39 UTC 2006 s390x s390x s390x GNU/Linux
Failed to make packages for lsbdev-cc
if test ! -e .need_config_update || test 3.95.0.20081030-1 != `cat .need_config_update`; \
  then echo 3.95.0.20081030-1 > .need_config_update; \
fi
sed -e "s#@LSBVERSION@#`echo 3.95.0.20081030`#" -e "s#@PACKAGE_RELEASE@#`echo 1`#" < lsb-build-cc.spec.sed > lsb-build-cc.spec
if [ -e /home/autobuild/tmp/lsb-build-cc-3.95.0.20081030 ]; then rm -rf /home/autobuild/tmp/lsb-build-cc-3.95.0.20081030; fi
mkdir -p /home/autobuild/tmp/lsb-build-cc-3.95.0.20081030
cd /home/autobuild/tmp/lsb-build-cc-3.95.0.20081030 && /home/autobuild/tmp/lsb_autobuild.8752/packaging/lsbdev-cc/../bzr-export build_env/lsbdev-cc
cp -pr README Licence /home/autobuild/tmp/lsb-build-cc-3.95.0.20081030
cp -p Makefile.build /home/autobuild/tmp/lsb-build-cc-3.95.0.20081030/Makefile
cd /home/autobuild/tmp/lsb-build-cc-3.95.0.20081030/.. && tar cvfz /home/autobuild/tmp/lsb_autobuild.8752/packaging/lsbdev-cc/lsb-build-cc-3.95.0.20081030.tar.gz lsb-build-cc-3.95.0.20081030 && rm -rf /home/autobuild/tmp/lsb-build-cc-3.95.0.20081030
lsb-build-cc-3.95.0.20081030/
lsb-build-cc-3.95.0.20081030/Makefile
lsb-build-cc-3.95.0.20081030/README
lsb-build-cc-3.95.0.20081030/Licence
lsb-build-cc-3.95.0.20081030/build_env/
lsb-build-cc-3.95.0.20081030/build_env/lsbdev-cc/
lsb-build-cc-3.95.0.20081030/build_env/lsbdev-cc/crti/
lsb-build-cc-3.95.0.20081030/build_env/lsbdev-cc/crti/libc-symbols.h
lsb-build-cc-3.95.0.20081030/build_env/lsbdev-cc/crti/README
lsb-build-cc-3.95.0.20081030/build_env/lsbdev-cc/crti/makefile
lsb-build-cc-3.95.0.20081030/build_env/lsbdev-cc/crti/symbol-hacks.h
lsb-build-cc-3.95.0.20081030/build_env/lsbdev-cc/crti/defs.h
lsb-build-cc-3.95.0.20081030/build_env/lsbdev-cc/crti/crti.S
lsb-build-cc-3.95.0.20081030/build_env/lsbdev-cc/crti/config.h
lsb-build-cc-3.95.0.20081030/build_env/lsbdev-cc/lsbcpp.c
lsb-build-cc-3.95.0.20081030/build_env/lsbdev-cc/makefile
lsb-build-cc-3.95.0.20081030/build_env/lsbdev-cc/lsbcc.1
lsb-build-cc-3.95.0.20081030/build_env/lsbdev-cc/lsbcc.c
lsb-build-cc-3.95.0.20081030/build_env/lsbdev-cc/lsbcc_argv.c
lsb-build-cc-3.95.0.20081030/build_env/lsbdev-cc/lsbcc_argv.h
lsb-build-cc-3.95.0.20081030/build_env/lsbdev-cc/besteffort.c
lsb-build-cc-3.95.0.20081030/build_env/lsbdev-cc/lsbcc_version.h
lsb-build-cc-3.95.0.20081030/build_env/lsbdev-cc/elf_utils.c
lsb-build-cc-3.95.0.20081030/build_env/lsbdev-cc/elf_utils.h
lsb-build-cc-3.95.0.20081030/build_env/lsbdev-cc/mk_lsbcc_version.pl
lsb-build-cc-3.95.0.20081030/build_env/lsbdev-cc/lsbcc_libs.h
lsb-build-cc-3.95.0.20081030/build_env/lsbdev-cc/linkers.h
lsb-build-cc-3.95.0.20081030/build_env/lsbdev-cc/gcc34-compat.cc
lsb-build-cc-3.95.0.20081030/build_env/lsbdev-cc/mk_lsbcc_libs.pl
lsb-build-cc-3.95.0.20081030/build_env/lsbdev-cc/ChangeLog
spawn rpmbuild --sign --rcfile /usr/lib/rpm/rpmrc:../rpmrc --define=_sourcedir /home/autobuild/tmp/lsb_autobuild.8752/packaging/lsbdev-cc --define=buildroot /home/autobuild/tmp/lsb-build-cc-3.95.0.20081030 --define=_topdir /home/autobuild/tmp/rpm-build --define=_target_cpu s390x -bb lsb-build-cc.spec
Enter pass phrase: 
Pass phrase is good.
Executing(%prep): /bin/sh -e /var/tmp/rpm-tmp.17698
+ umask 022
+ cd /home/autobuild/tmp/rpm-build/BUILD
+ cd /home/autobuild/tmp/rpm-build/BUILD
+ rm -rf lsb-build-cc-3.95.0.20081030
+ /usr/bin/gzip -dc /home/autobuild/tmp/lsb_autobuild.8752/packaging/lsbdev-cc/lsb-build-cc-3.95.0.20081030.tar.gz
+ tar -xf -
+ STATUS=0
+ '[' 0 -ne 0 ']'
+ cd lsb-build-cc-3.95.0.20081030
+ exit 0
Executing(%build): /bin/sh -e /var/tmp/rpm-tmp.17698
+ umask 022
+ cd /home/autobuild/tmp/rpm-build/BUILD
+ cd lsb-build-cc-3.95.0.20081030
+ make CC=/opt/lsb/bin/lsbcc CXX=/opt/lsb/bin/lsbc++ LSBVERSION=3.95.0.20081030 LSBLIBCHK_VERSION=3.95.0.20081030-1
make[1]: Entering directory `/home/autobuild/tmp/rpm-build/BUILD/lsb-build-cc-3.95.0.20081030'
cd build_env/lsbdev-cc && make 
make[2]: Entering directory `/home/autobuild/tmp/rpm-build/BUILD/lsb-build-cc-3.95.0.20081030/build_env/lsbdev-cc'
/opt/lsb/bin/lsbcc -g -Wall   -c -o lsbcc.o lsbcc.c
In file included from /opt/lsb/include/sys/stat.h:6,
                 from lsbcc.c:49:
/opt/lsb/include/unistd.h:497: error: expected declaration specifiers or '...' before '__gid_t'
make[2]: *** [lsbcc.o] Error 1
make[2]: Leaving directory `/home/autobuild/tmp/rpm-build/BUILD/lsb-build-cc-3.95.0.20081030/build_env/lsbdev-cc'
make[1]: *** [all] Error 2
make[1]: Leaving directory `/home/autobuild/tmp/rpm-build/BUILD/lsb-build-cc-3.95.0.20081030'
error: Bad exit status from /var/tmp/rpm-tmp.17698 (%build)


RPM build errors:
    Bad exit status from /var/tmp/rpm-tmp.17698 (%build)
expect: spawn id exp3 not open
    while executing
"expect "exit 0""
send: spawn id exp3 not open
    while executing
"send "\n""
mv: cannot stat `/home/autobuild/tmp/rpm-build/RPMS/s390x/lsb-build-cc-3.95.0.20081030-1.s390x.rpm': No such file or directory
make: *** [lsb-build-cc-3.95.0.20081030-1.s390x.rpm] Error 1


More information about the lsb-messages mailing list