[Lsb-messages] Build failure for tet-harness on ppc

lsb-autobuild at freestandards.org lsb-autobuild at freestandards.org
Thu Oct 30 01:05:48 PDT 2008


This is an automated message generated when a build failure occurs

Linux lfdev-power64 2.6.18-6-powerpc64 #1 SMP Tue Aug 19 11:59:49 UTC 2008 ppc ppc ppc GNU/Linux
Failed to make packages for tet-harness
rm -f /tet3.7-unsup.src.tgz /tet3-lite-manpages-v1.1.tgz /tet3.7-lite-lsb.patch /tet3.7-lite.patch tet3.7-unsup.src.tgz tet3-lite-manpages-v1.1.tgz support.tgz *.rpm *.deb
fetching http://www.opengroup.org/infosrv/TET/TET3//tet3.7-unsup.src.tgz ...
--08:10:01--  http://www.opengroup.org/infosrv/TET/TET3//tet3.7-unsup.src.tgz
           => `tet3.7-unsup.src.tgz'
Resolving www.opengroup.org... 192.153.166.92
Connecting to www.opengroup.org|192.153.166.92|:80... connected.
HTTP request sent, awaiting response... 200 OK
Length: 953,406 (931K) [application/x-tar]

    0K .......... .......... .......... .......... ..........  5%   32.52 KB/s
   50K .......... .......... .......... .......... .......... 10%   52.17 KB/s
  100K .......... .......... .......... .......... .......... 16%   68.75 KB/s
  150K .......... .......... .......... .......... .......... 21%   84.91 KB/s
  200K .......... .......... .......... .......... .......... 26%   95.48 KB/s
  250K .......... .......... .......... .......... .......... 32%  118.43 KB/s
  300K .......... .......... .......... .......... .......... 37%  115.88 KB/s
  350K .......... .......... .......... .......... .......... 42%  146.93 KB/s
  400K .......... .......... .......... .......... .......... 48%  131.57 KB/s
  450K .......... .......... .......... .......... .......... 53%  161.00 KB/s
  500K .......... .......... .......... .......... .......... 59%  162.50 KB/s
  550K .......... .......... .......... .......... .......... 64%  154.59 KB/s
  600K .......... .......... .......... .......... .......... 69%  130.54 KB/s
  650K .......... .......... .......... .......... .......... 75%  184.02 KB/s
  700K .......... .......... .......... .......... .......... 80%  161.65 KB/s
  750K .......... .......... .......... .......... .......... 85%  172.15 KB/s
  800K .......... .......... .......... .......... .......... 91%  283.85 KB/s
  850K .......... .......... .......... .......... .......... 96%  173.80 KB/s
  900K .......... .......... .......... .                    100%  206.37 KB/s

08:10:10 (106.77 KB/s) - `tet3.7-unsup.src.tgz' saved [953406/953406]

fetching http://www.opengroup.org/infosrv/TET/TET3//tet3-lite-manpages-v1.1.tgz ...
--08:10:10--  http://www.opengroup.org/infosrv/TET/TET3//tet3-lite-manpages-v1.1.tgz
           => `tet3-lite-manpages-v1.1.tgz'
Resolving www.opengroup.org... 192.153.166.92
Connecting to www.opengroup.org|192.153.166.92|:80... connected.
HTTP request sent, awaiting response... 200 OK
Length: 16,499 (16K) [application/x-tar]

    0K .......... ......                                     100%   51.85 KB/s

08:10:11 (51.85 KB/s) - `tet3-lite-manpages-v1.1.tgz' saved [16499/16499]

tar zcvf support.tgz support
support/
support/tjreport
support/tjreport.1
spawn rpmbuild --sign --rcfile /usr/lib/rpm/rpmrc:./rpmrc --define=_sourcedir /nethome/autobuild/tmp/LSBauto/tet-harness/package --define=_topdir /nethome/autobuild/tmp/rpm-build --define=_target_cpu ppc --define=_defaultdocdir /opt/lsb-tet3-lite/doc --define=LSBRelease 4 --define=rel 12 -ba lsb-tet3-lite.spec
Enter pass phrase: 
Pass phrase is good.
Executing(%prep): /bin/sh -e /var/tmp/rpm-tmp.19102
+ umask 022
+ cd /nethome/autobuild/tmp/rpm-build/BUILD
+ '[' '!' -x /opt/lsb/bin/lsbcc ']'
+ '[' '!' -x /opt/lsb/bin/lsbc++ ']'
+ cd /nethome/autobuild/tmp/rpm-build/BUILD
+ rm -rf tet3-lite-3.7
+ /bin/mkdir -p tet3-lite-3.7
+ cd tet3-lite-3.7
+ /usr/bin/gzip -dc /nethome/autobuild/tmp/LSBauto/tet-harness/package/tet3.7-unsup.src.tgz
+ tar -xf -
+ STATUS=0
+ '[' 0 -ne 0 ']'
+ /usr/bin/gzip -dc /nethome/autobuild/tmp/LSBauto/tet-harness/package/tet3-lite-manpages-v1.1.tgz
+ tar -xf -
+ STATUS=0
+ '[' 0 -ne 0 ']'
+ echo 'Patch #0 (tet3.7-lite-lsb.patch):'
Patch #0 (tet3.7-lite-lsb.patch):
+ patch -p1 -s
+ echo 'Patch #1 (tet3.7-lite-getline.patch):'
Patch #1 (tet3.7-lite-getline.patch):
+ patch -p1 -s
+ '[' -n '' ']'
+ '[' -n '' ']'
+ exit 0
Executing(%build): /bin/sh -e /var/tmp/rpm-tmp.59645
+ umask 022
+ cd /nethome/autobuild/tmp/rpm-build/BUILD
+ cd tet3-lite-3.7
+ unset PYTHONPATH
+ python
+ . ./.PYTHONINFO
++ PYTHONLIB=/usr/lib/python2.4
++ PYTHONINCLUDE=/usr/include/python2.4
+ '[' '!' -d /usr/lib/python2.4 ']'
+ '[' '!' -f /usr/include/python2.4/Python.h ']'
++ pwd
+ export TET_ROOT=/nethome/autobuild/tmp/rpm-build/BUILD/tet3-lite-3.7
+ TET_ROOT=/nethome/autobuild/tmp/rpm-build/BUILD/tet3-lite-3.7
+ sh ./configure -t lite

./configure: Linux detected.
If the JDK is installed on this machine, you have installed
the TETware Java API and you want to build the API,
you must edit src/defines.mk and specify where the
JDK include files have been installed on this machine.
The comments below the heading 'Support for Java' tell you
what to do.

./configure: using defines/linux.mk
TETware-Lite configuration completed

OS=ppc-whatever-linux2 Configured

./configure: the selected defines.mk file has been designed to build
Distributed TETware to use the socket network interface.
If you are building a different version of TETware you may need
to edit the file src/defines.mk before building TETware.
For example: if network libraries have been specified in the
SYSLIBS assignment, you don't need these when building TETware-Lite.

To build TETware:
	cd src; make; make install
+ cd src
+ make
make[1]: Entering directory `/nethome/autobuild/tmp/rpm-build/BUILD/tet3-lite-3.7/src'
tet3...
make[2]: Entering directory `/nethome/autobuild/tmp/rpm-build/BUILD/tet3-lite-3.7/src/tet3'
tcm:
make[3]: Entering directory `/nethome/autobuild/tmp/rpm-build/BUILD/tet3-lite-3.7/src/tet3/tcm'
+ test -n ''
touch dynlink_gen_made
/opt/lsb/bin/lsbcc -I../inc -I../../../inc/tet3 -D_POSIX_SOURCE  -DTET_LITE -I. -O -fPIC -c dynlink.c
/opt/lsb/bin/lsbcc -I../inc -I../../../inc/tet3 -DINETD -DTET_LITE -I. -O -fPIC -c tcm_main.c
In file included from /opt/lsb/include/stdio.h:6,
                 from tcmhdrs.h:62,
                 from tcm_main.c:178:
/opt/lsb/include/unistd.h:497: error: expected declaration specifiers or ‘...’ before ‘__gid_t’
make[3]: *** [tcm_main.o] Error 1
make[3]: Leaving directory `/nethome/autobuild/tmp/rpm-build/BUILD/tet3-lite-3.7/src/tet3/tcm'
apilib:
make[3]: Entering directory `/nethome/autobuild/tmp/rpm-build/BUILD/tet3-lite-3.7/src/tet3/apilib'
/opt/lsb/bin/lsbcc -I. -I../inc -I../../../inc/tet3 -D_POSIX_SOURCE  -DTET_LITE  -O -fPIC -c libvers.c
In file included from /opt/lsb/include/stdio.h:6,
                 from libvers.c:45:
/opt/lsb/include/unistd.h:497: error: expected declaration specifiers or ‘...’ before ‘__gid_t’
make[3]: *** [libvers.o] Error 1
make[3]: Leaving directory `/nethome/autobuild/tmp/rpm-build/BUILD/tet3-lite-3.7/src/tet3/apilib'
dtet2lib:
make[3]: Entering directory `/nethome/autobuild/tmp/rpm-build/BUILD/tet3-lite-3.7/src/tet3/dtet2lib'
/opt/lsb/bin/lsbcc -I../inc -I../../../inc/tet3 -D_POSIX_SOURCE  -DTET_LITE  -O -fPIC -c addarg.c
In file included from /opt/lsb/include/stdio.h:6,
                 from addarg.c:32:
/opt/lsb/include/unistd.h:497: error: expected declaration specifiers or ‘...’ before ‘__gid_t’
make[3]: *** [addarg.o] Error 1
make[3]: Leaving directory `/nethome/autobuild/tmp/rpm-build/BUILD/tet3-lite-3.7/src/tet3/dtet2lib'
tcclib:
make[3]: Entering directory `/nethome/autobuild/tmp/rpm-build/BUILD/tet3-lite-3.7/src/tet3/tcclib'
/opt/lsb/bin/lsbcc -I../inc -I../../../inc/tet3 -D_POSIX_SOURCE  -DTET_LITE  -O -fPIC -c lockfile.c
In file included from /opt/lsb/include/stdio.h:6,
                 from lockfile.c:41:
/opt/lsb/include/unistd.h:497: error: expected declaration specifiers or ‘...’ before ‘__gid_t’
make[3]: *** [lockfile.o] Error 1
make[3]: Leaving directory `/nethome/autobuild/tmp/rpm-build/BUILD/tet3-lite-3.7/src/tet3/tcclib'
tcc:
make[3]: Entering directory `/nethome/autobuild/tmp/rpm-build/BUILD/tet3-lite-3.7/src/tet3/tcc'
/opt/lsb/bin/lsbcc -I../inc -I../../../inc/tet3 -D_POSIX_SOURCE  -DTET_LITE  -O -fPIC -c tcc.c
In file included from /opt/lsb/include/stdio.h:6,
                 from tcc.c:71:
/opt/lsb/include/unistd.h:497: error: expected declaration specifiers or ‘...’ before ‘__gid_t’
make[3]: *** [tcc.o] Error 1
make[3]: Leaving directory `/nethome/autobuild/tmp/rpm-build/BUILD/tet3-lite-3.7/src/tet3/tcc'
tcmthr:
make[3]: Entering directory `/nethome/autobuild/tmp/rpm-build/BUILD/tet3-lite-3.7/src/tet3/tcmthr'
+ test -n ''
touch dynlink_gen_made
/opt/lsb/bin/lsbcc -I../inc -I../../../inc/tet3 -D_POSIX_C_SOURCE=199506 -DTET_LITE -DTET_THREADS -I../tcm/. -D_REENTRANT -DTET_POSIX_THREADS -c ../tcm/dynlink.c
/opt/lsb/bin/lsbcc -I../inc -I../../../inc/tet3 -DINETD -DTET_LITE -DTET_THREADS -I../tcm/. -D_REENTRANT -DTET_POSIX_THREADS -c ../tcm/tcm_main.c
In file included from /opt/lsb/include/stdio.h:6,
                 from ../tcm/tcmhdrs.h:62,
                 from ../tcm/tcm_main.c:178:
/opt/lsb/include/unistd.h:497: error: expected declaration specifiers or ‘...’ before ‘__gid_t’
make[3]: *** [tcm_main.o] Error 1
make[3]: Leaving directory `/nethome/autobuild/tmp/rpm-build/BUILD/tet3-lite-3.7/src/tet3/tcmthr'
apithr:
make[3]: Entering directory `/nethome/autobuild/tmp/rpm-build/BUILD/tet3-lite-3.7/src/tet3/apithr'
/opt/lsb/bin/lsbcc -I../inc -I../../../inc/tet3 -D_POSIX_C_SOURCE=199506 -DTET_LITE -DTET_THREADS -D_REENTRANT -DTET_POSIX_THREADS -c api_lock.c
/opt/lsb/bin/lsbcc -I../inc -I../../../inc/tet3 -D_POSIX_C_SOURCE=199506 -DTET_LITE -DTET_THREADS -D_REENTRANT -DTET_POSIX_THREADS -c mutexes.c
In file included from /opt/lsb/include/stdio.h:6,
                 from mutexes.c:67:
/opt/lsb/include/unistd.h:497: error: expected declaration specifiers or ‘...’ before ‘__gid_t’
make[3]: *** [mutexes.o] Error 1
make[3]: Leaving directory `/nethome/autobuild/tmp/rpm-build/BUILD/tet3-lite-3.7/src/tet3/apithr'
apishlib:
make[3]: Entering directory `/nethome/autobuild/tmp/rpm-build/BUILD/tet3-lite-3.7/src/tet3/apishlib'
/opt/lsb/bin/lsbcc -I../apilib/. -I../inc -I../../../inc/tet3 -D_POSIX_SOURCE  -DTET_LITE -DTET_SHLIB_SOURCE -O -fPIC -fPIC -c ../apilib/libvers.c
In file included from /opt/lsb/include/stdio.h:6,
                 from ../apilib/libvers.c:45:
/opt/lsb/include/unistd.h:497: error: expected declaration specifiers or ‘...’ before ‘__gid_t’
make[3]: *** [libvers.o] Error 1
make[3]: Leaving directory `/nethome/autobuild/tmp/rpm-build/BUILD/tet3-lite-3.7/src/tet3/apishlib'
tcmshlib:
make[3]: Entering directory `/nethome/autobuild/tmp/rpm-build/BUILD/tet3-lite-3.7/src/tet3/tcmshlib'
+ test -n ../apishlib/
+ cd ../apishlib/
+ make dynlink.gen
make[4]: Entering directory `/nethome/autobuild/tmp/rpm-build/BUILD/tet3-lite-3.7/src/tet3/apishlib'
touch dynlink.gen
make[4]: Leaving directory `/nethome/autobuild/tmp/rpm-build/BUILD/tet3-lite-3.7/src/tet3/apishlib'
touch dynlink_gen_made
/opt/lsb/bin/lsbcc -I../inc -I../../../inc/tet3 -D_POSIX_SOURCE  -DTET_LITE -DTET_SHLIB -I../tcm/. -I../apishlib/. -O -fPIC -c ../tcm/dynlink.c
/opt/lsb/bin/lsbcc -I../inc -I../../../inc/tet3 -DINETD -DTET_LITE -DTET_SHLIB -I../tcm/. -I../apishlib/. -O -fPIC -c ../tcm/tcm_main.c
In file included from /opt/lsb/include/stdio.h:6,
                 from ../tcm/tcmhdrs.h:62,
                 from ../tcm/tcm_main.c:178:
/opt/lsb/include/unistd.h:497: error: expected declaration specifiers or ‘...’ before ‘__gid_t’
make[3]: *** [tcm_main.o] Error 1
make[3]: Leaving directory `/nethome/autobuild/tmp/rpm-build/BUILD/tet3-lite-3.7/src/tet3/tcmshlib'
apithrshlib:
make[3]: Entering directory `/nethome/autobuild/tmp/rpm-build/BUILD/tet3-lite-3.7/src/tet3/apithrshlib'
/opt/lsb/bin/lsbcc -I../apilib/. -I../inc -I../../../inc/tet3 -D_POSIX_C_SOURCE=199506 -DTET_LITE -DTET_THREADS -DTET_SHLIB_SOURCE -D_REENTRANT -DTET_POSIX_THREADS -fPIC -c ../apilib/libvers.c
In file included from /opt/lsb/include/stdio.h:6,
                 from ../apilib/libvers.c:45:
/opt/lsb/include/unistd.h:497: error: expected declaration specifiers or ‘...’ before ‘__gid_t’
make[3]: *** [libvers.o] Error 1
make[3]: Leaving directory `/nethome/autobuild/tmp/rpm-build/BUILD/tet3-lite-3.7/src/tet3/apithrshlib'
tcmthrshlib:
make[3]: Entering directory `/nethome/autobuild/tmp/rpm-build/BUILD/tet3-lite-3.7/src/tet3/tcmthrshlib'
+ test -n ../apithrshlib/
+ cd ../apithrshlib/
+ make dynlink.gen
make[4]: Entering directory `/nethome/autobuild/tmp/rpm-build/BUILD/tet3-lite-3.7/src/tet3/apithrshlib'
+ case `uname -s` in
++ uname -s
+ touch dynlink.gen
make[4]: Leaving directory `/nethome/autobuild/tmp/rpm-build/BUILD/tet3-lite-3.7/src/tet3/apithrshlib'
touch dynlink_gen_made
/opt/lsb/bin/lsbcc -I../inc -I../../../inc/tet3 -D_POSIX_C_SOURCE=199506 -DTET_LITE -DTET_THREADS -DTET_SHLIB -I../tcm/. -I../apithrshlib/. -D_REENTRANT -DTET_POSIX_THREADS -c ../tcm/dynlink.c
/opt/lsb/bin/lsbcc -I../inc -I../../../inc/tet3 -DINETD -DTET_LITE -DTET_THREADS -DTET_SHLIB -I../tcm/. -I../apithrshlib/. -D_REENTRANT -DTET_POSIX_THREADS -c ../tcm/tcm_main.c
In file included from /opt/lsb/include/stdio.h:6,
                 from ../tcm/tcmhdrs.h:62,
                 from ../tcm/tcm_main.c:178:
/opt/lsb/include/unistd.h:497: error: expected declaration specifiers or ‘...’ before ‘__gid_t’
make[3]: *** [tcm_main.o] Error 1
make[3]: Leaving directory `/nethome/autobuild/tmp/rpm-build/BUILD/tet3-lite-3.7/src/tet3/tcmthrshlib'
tcm(C++):
make[3]: Entering directory `/nethome/autobuild/tmp/rpm-build/BUILD/tet3-lite-3.7/src/tet3/tcm'
/opt/lsb/bin/lsbcc -I../inc -I../../../inc/tet3 -DINETD -DTET_LITE -I. -O -fPIC -c tcm_main.c
In file included from /opt/lsb/include/stdio.h:6,
                 from tcmhdrs.h:62,
                 from tcm_main.c:178:
/opt/lsb/include/unistd.h:497: error: expected declaration specifiers or ‘...’ before ‘__gid_t’
make[3]: *** [tcm_main.o] Error 1
make[3]: Leaving directory `/nethome/autobuild/tmp/rpm-build/BUILD/tet3-lite-3.7/src/tet3/tcm'
tcmthr(C++):
make[3]: Entering directory `/nethome/autobuild/tmp/rpm-build/BUILD/tet3-lite-3.7/src/tet3/tcmthr'
/opt/lsb/bin/lsbcc -I../inc -I../../../inc/tet3 -DINETD -DTET_LITE -DTET_THREADS -I../tcm/. -D_REENTRANT -DTET_POSIX_THREADS -c ../tcm/tcm_main.c
In file included from /opt/lsb/include/stdio.h:6,
                 from ../tcm/tcmhdrs.h:62,
                 from ../tcm/tcm_main.c:178:
/opt/lsb/include/unistd.h:497: error: expected declaration specifiers or ‘...’ before ‘__gid_t’
make[3]: *** [tcm_main.o] Error 1
make[3]: Leaving directory `/nethome/autobuild/tmp/rpm-build/BUILD/tet3-lite-3.7/src/tet3/tcmthr'
tcmshlib(C++):
make[3]: Entering directory `/nethome/autobuild/tmp/rpm-build/BUILD/tet3-lite-3.7/src/tet3/tcmshlib'
/opt/lsb/bin/lsbcc -I../inc -I../../../inc/tet3 -DINETD -DTET_LITE -DTET_SHLIB -I../tcm/. -I../apishlib/. -O -fPIC -c ../tcm/tcm_main.c
In file included from /opt/lsb/include/stdio.h:6,
                 from ../tcm/tcmhdrs.h:62,
                 from ../tcm/tcm_main.c:178:
/opt/lsb/include/unistd.h:497: error: expected declaration specifiers or ‘...’ before ‘__gid_t’
make[3]: *** [tcm_main.o] Error 1
make[3]: Leaving directory `/nethome/autobuild/tmp/rpm-build/BUILD/tet3-lite-3.7/src/tet3/tcmshlib'
tcmthrshlib(C++):
make[3]: Entering directory `/nethome/autobuild/tmp/rpm-build/BUILD/tet3-lite-3.7/src/tet3/tcmthrshlib'
/opt/lsb/bin/lsbcc -I../inc -I../../../inc/tet3 -DINETD -DTET_LITE -DTET_THREADS -DTET_SHLIB -I../tcm/. -I../apithrshlib/. -D_REENTRANT -DTET_POSIX_THREADS -c ../tcm/tcm_main.c
In file included from /opt/lsb/include/stdio.h:6,
                 from ../tcm/tcmhdrs.h:62,
                 from ../tcm/tcm_main.c:178:
/opt/lsb/include/unistd.h:497: error: expected declaration specifiers or ‘...’ before ‘__gid_t’
make[3]: *** [tcm_main.o] Error 1
make[3]: Leaving directory `/nethome/autobuild/tmp/rpm-build/BUILD/tet3-lite-3.7/src/tet3/tcmthrshlib'
grw:
make[3]: Entering directory `/nethome/autobuild/tmp/rpm-build/BUILD/tet3-lite-3.7/src/tet3/grw'
/opt/lsb/bin/lsbcc -I../inc -I../../../inc/tet3 -D_POSIX_SOURCE  -DTET_LITE  -O -fPIC -c formatter.c
In file included from /opt/lsb/include/stdio.h:6,
                 from formatter.c:94:
/opt/lsb/include/unistd.h:497: error: expected declaration specifiers or ‘...’ before ‘__gid_t’
make[3]: *** [formatter.o] Error 1
make[3]: Leaving directory `/nethome/autobuild/tmp/rpm-build/BUILD/tet3-lite-3.7/src/tet3/grw'
make[2]: *** [all] Error 2
make[2]: Leaving directory `/nethome/autobuild/tmp/rpm-build/BUILD/tet3-lite-3.7/src/tet3'
xpg3sh/api...
make[2]: Entering directory `/nethome/autobuild/tmp/rpm-build/BUILD/tet3-lite-3.7/src/xpg3sh/api'
make[2]: Nothing to be done for `all'.
make[2]: Leaving directory `/nethome/autobuild/tmp/rpm-build/BUILD/tet3-lite-3.7/src/xpg3sh/api'
ksh/api...
make[2]: Entering directory `/nethome/autobuild/tmp/rpm-build/BUILD/tet3-lite-3.7/src/ksh/api'
make[2]: Nothing to be done for `all'.
make[2]: Leaving directory `/nethome/autobuild/tmp/rpm-build/BUILD/tet3-lite-3.7/src/ksh/api'
posix_sh/api...
make[2]: Entering directory `/nethome/autobuild/tmp/rpm-build/BUILD/tet3-lite-3.7/src/posix_sh/api'
sed -e 's/STD_SIGNAL_LIST/1 2 3 4 6 8 13 14 15 10 12 20 18 21 22/' \
-e 's/SPEC_SIGNAL_LIST/9 17 19 11/' \
-e 's/TET_NSIG_NUM/32/' tcm.sh > tmp$$ && \
		test -s tmp$$ && mv tmp$$ tcm.gen
make[2]: Leaving directory `/nethome/autobuild/tmp/rpm-build/BUILD/tet3-lite-3.7/src/posix_sh/api'
scripts...
make[2]: Entering directory `/nethome/autobuild/tmp/rpm-build/BUILD/tet3-lite-3.7/src/scripts'
case `uname -s` in \
Windows_*) \
	sed -f install.sed -f win32.sed tet_start.sh > tmp$$ \
	;; \
*) \
	sed -f install.sed -f unix.sed tet_start.sh > tmp$$ \
	;; \
esac && \
test -s tmp$$ && mv tmp$$ tet_start
make[2]: Leaving directory `/nethome/autobuild/tmp/rpm-build/BUILD/tet3-lite-3.7/src/scripts'
perl...
make[2]: Entering directory `/nethome/autobuild/tmp/rpm-build/BUILD/tet3-lite-3.7/src/perl'
make[2]: Nothing to be done for `all'.
make[2]: Leaving directory `/nethome/autobuild/tmp/rpm-build/BUILD/tet3-lite-3.7/src/perl'
make[1]: Leaving directory `/nethome/autobuild/tmp/rpm-build/BUILD/tet3-lite-3.7/src'
+ make install
make[1]: Entering directory `/nethome/autobuild/tmp/rpm-build/BUILD/tet3-lite-3.7/src'
tet3...
make[2]: Entering directory `/nethome/autobuild/tmp/rpm-build/BUILD/tet3-lite-3.7/src/tet3'
tcm:
make[3]: Entering directory `/nethome/autobuild/tmp/rpm-build/BUILD/tet3-lite-3.7/src/tet3/tcm'
/opt/lsb/bin/lsbcc -I../inc -I../../../inc/tet3 -DINETD -DTET_LITE -I. -O -fPIC -c tcm_main.c
In file included from /opt/lsb/include/stdio.h:6,
                 from tcmhdrs.h:62,
                 from tcm_main.c:178:
/opt/lsb/include/unistd.h:497: error: expected declaration specifiers or ‘...’ before ‘__gid_t’
make[3]: *** [tcm_main.o] Error 1
make[3]: Leaving directory `/nethome/autobuild/tmp/rpm-build/BUILD/tet3-lite-3.7/src/tet3/tcm'
apilib:
make[3]: Entering directory `/nethome/autobuild/tmp/rpm-build/BUILD/tet3-lite-3.7/src/tet3/apilib'
/opt/lsb/bin/lsbcc -I. -I../inc -I../../../inc/tet3 -D_POSIX_SOURCE  -DTET_LITE  -O -fPIC -c libvers.c
In file included from /opt/lsb/include/stdio.h:6,
                 from libvers.c:45:
/opt/lsb/include/unistd.h:497: error: expected declaration specifiers or ‘...’ before ‘__gid_t’
make[3]: *** [libvers.o] Error 1
make[3]: Leaving directory `/nethome/autobuild/tmp/rpm-build/BUILD/tet3-lite-3.7/src/tet3/apilib'
dtet2lib:
make[3]: Entering directory `/nethome/autobuild/tmp/rpm-build/BUILD/tet3-lite-3.7/src/tet3/dtet2lib'
/opt/lsb/bin/lsbcc -I../inc -I../../../inc/tet3 -D_POSIX_SOURCE  -DTET_LITE  -O -fPIC -c addarg.c
In file included from /opt/lsb/include/stdio.h:6,
                 from addarg.c:32:
/opt/lsb/include/unistd.h:497: error: expected declaration specifiers or ‘...’ before ‘__gid_t’
make[3]: *** [addarg.o] Error 1
make[3]: Leaving directory `/nethome/autobuild/tmp/rpm-build/BUILD/tet3-lite-3.7/src/tet3/dtet2lib'
tcclib:
make[3]: Entering directory `/nethome/autobuild/tmp/rpm-build/BUILD/tet3-lite-3.7/src/tet3/tcclib'
/opt/lsb/bin/lsbcc -I../inc -I../../../inc/tet3 -D_POSIX_SOURCE  -DTET_LITE  -O -fPIC -c lockfile.c
In file included from /opt/lsb/include/stdio.h:6,
                 from lockfile.c:41:
/opt/lsb/include/unistd.h:497: error: expected declaration specifiers or ‘...’ before ‘__gid_t’
make[3]: *** [lockfile.o] Error 1
make[3]: Leaving directory `/nethome/autobuild/tmp/rpm-build/BUILD/tet3-lite-3.7/src/tet3/tcclib'
tcc:
make[3]: Entering directory `/nethome/autobuild/tmp/rpm-build/BUILD/tet3-lite-3.7/src/tet3/tcc'
/opt/lsb/bin/lsbcc -I../inc -I../../../inc/tet3 -D_POSIX_SOURCE  -DTET_LITE  -O -fPIC -c tcc.c
In file included from /opt/lsb/include/stdio.h:6,
                 from tcc.c:71:
/opt/lsb/include/unistd.h:497: error: expected declaration specifiers or ‘...’ before ‘__gid_t’
make[3]: *** [tcc.o] Error 1
make[3]: Leaving directory `/nethome/autobuild/tmp/rpm-build/BUILD/tet3-lite-3.7/src/tet3/tcc'
tcmthr:
make[3]: Entering directory `/nethome/autobuild/tmp/rpm-build/BUILD/tet3-lite-3.7/src/tet3/tcmthr'
/opt/lsb/bin/lsbcc -I../inc -I../../../inc/tet3 -DINETD -DTET_LITE -DTET_THREADS -I../tcm/. -D_REENTRANT -DTET_POSIX_THREADS -c ../tcm/tcm_main.c
In file included from /opt/lsb/include/stdio.h:6,
                 from ../tcm/tcmhdrs.h:62,
                 from ../tcm/tcm_main.c:178:
/opt/lsb/include/unistd.h:497: error: expected declaration specifiers or ‘...’ before ‘__gid_t’
make[3]: *** [tcm_main.o] Error 1
make[3]: Leaving directory `/nethome/autobuild/tmp/rpm-build/BUILD/tet3-lite-3.7/src/tet3/tcmthr'
apithr:
make[3]: Entering directory `/nethome/autobuild/tmp/rpm-build/BUILD/tet3-lite-3.7/src/tet3/apithr'
/opt/lsb/bin/lsbcc -I../inc -I../../../inc/tet3 -D_POSIX_C_SOURCE=199506 -DTET_LITE -DTET_THREADS -D_REENTRANT -DTET_POSIX_THREADS -c mutexes.c
In file included from /opt/lsb/include/stdio.h:6,
                 from mutexes.c:67:
/opt/lsb/include/unistd.h:497: error: expected declaration specifiers or ‘...’ before ‘__gid_t’
make[3]: *** [mutexes.o] Error 1
make[3]: Leaving directory `/nethome/autobuild/tmp/rpm-build/BUILD/tet3-lite-3.7/src/tet3/apithr'
apishlib:
make[3]: Entering directory `/nethome/autobuild/tmp/rpm-build/BUILD/tet3-lite-3.7/src/tet3/apishlib'
/opt/lsb/bin/lsbcc -I../apilib/. -I../inc -I../../../inc/tet3 -D_POSIX_SOURCE  -DTET_LITE -DTET_SHLIB_SOURCE -O -fPIC -fPIC -c ../apilib/libvers.c
In file included from /opt/lsb/include/stdio.h:6,
                 from ../apilib/libvers.c:45:
/opt/lsb/include/unistd.h:497: error: expected declaration specifiers or ‘...’ before ‘__gid_t’
make[3]: *** [libvers.o] Error 1
make[3]: Leaving directory `/nethome/autobuild/tmp/rpm-build/BUILD/tet3-lite-3.7/src/tet3/apishlib'
tcmshlib:
make[3]: Entering directory `/nethome/autobuild/tmp/rpm-build/BUILD/tet3-lite-3.7/src/tet3/tcmshlib'
/opt/lsb/bin/lsbcc -I../inc -I../../../inc/tet3 -DINETD -DTET_LITE -DTET_SHLIB -I../tcm/. -I../apishlib/. -O -fPIC -c ../tcm/tcm_main.c
In file included from /opt/lsb/include/stdio.h:6,
                 from ../tcm/tcmhdrs.h:62,
                 from ../tcm/tcm_main.c:178:
/opt/lsb/include/unistd.h:497: error: expected declaration specifiers or ‘...’ before ‘__gid_t’
make[3]: *** [tcm_main.o] Error 1
make[3]: Leaving directory `/nethome/autobuild/tmp/rpm-build/BUILD/tet3-lite-3.7/src/tet3/tcmshlib'
apithrshlib:
make[3]: Entering directory `/nethome/autobuild/tmp/rpm-build/BUILD/tet3-lite-3.7/src/tet3/apithrshlib'
/opt/lsb/bin/lsbcc -I../apilib/. -I../inc -I../../../inc/tet3 -D_POSIX_C_SOURCE=199506 -DTET_LITE -DTET_THREADS -DTET_SHLIB_SOURCE -D_REENTRANT -DTET_POSIX_THREADS -fPIC -c ../apilib/libvers.c
In file included from /opt/lsb/include/stdio.h:6,
                 from ../apilib/libvers.c:45:
/opt/lsb/include/unistd.h:497: error: expected declaration specifiers or ‘...’ before ‘__gid_t’
make[3]: *** [libvers.o] Error 1
make[3]: Leaving directory `/nethome/autobuild/tmp/rpm-build/BUILD/tet3-lite-3.7/src/tet3/apithrshlib'
tcmthrshlib:
make[3]: Entering directory `/nethome/autobuild/tmp/rpm-build/BUILD/tet3-lite-3.7/src/tet3/tcmthrshlib'
/opt/lsb/bin/lsbcc -I../inc -I../../../inc/tet3 -DINETD -DTET_LITE -DTET_THREADS -DTET_SHLIB -I../tcm/. -I../apithrshlib/. -D_REENTRANT -DTET_POSIX_THREADS -c ../tcm/tcm_main.c
In file included from /opt/lsb/include/stdio.h:6,
                 from ../tcm/tcmhdrs.h:62,
                 from ../tcm/tcm_main.c:178:
/opt/lsb/include/unistd.h:497: error: expected declaration specifiers or ‘...’ before ‘__gid_t’
make[3]: *** [tcm_main.o] Error 1
make[3]: Leaving directory `/nethome/autobuild/tmp/rpm-build/BUILD/tet3-lite-3.7/src/tet3/tcmthrshlib'
tcm(C++):
make[3]: Entering directory `/nethome/autobuild/tmp/rpm-build/BUILD/tet3-lite-3.7/src/tet3/tcm'
/opt/lsb/bin/lsbcc -I../inc -I../../../inc/tet3 -DINETD -DTET_LITE -I. -O -fPIC -c tcm_main.c
In file included from /opt/lsb/include/stdio.h:6,
                 from tcmhdrs.h:62,
                 from tcm_main.c:178:
/opt/lsb/include/unistd.h:497: error: expected declaration specifiers or ‘...’ before ‘__gid_t’
make[3]: *** [tcm_main.o] Error 1
make[3]: Leaving directory `/nethome/autobuild/tmp/rpm-build/BUILD/tet3-lite-3.7/src/tet3/tcm'
tcmthr(C++):
make[3]: Entering directory `/nethome/autobuild/tmp/rpm-build/BUILD/tet3-lite-3.7/src/tet3/tcmthr'
/opt/lsb/bin/lsbcc -I../inc -I../../../inc/tet3 -DINETD -DTET_LITE -DTET_THREADS -I../tcm/. -D_REENTRANT -DTET_POSIX_THREADS -c ../tcm/tcm_main.c
In file included from /opt/lsb/include/stdio.h:6,
                 from ../tcm/tcmhdrs.h:62,
                 from ../tcm/tcm_main.c:178:
/opt/lsb/include/unistd.h:497: error: expected declaration specifiers or ‘...’ before ‘__gid_t’
make[3]: *** [tcm_main.o] Error 1
make[3]: Leaving directory `/nethome/autobuild/tmp/rpm-build/BUILD/tet3-lite-3.7/src/tet3/tcmthr'
tcmshlib(C++):
make[3]: Entering directory `/nethome/autobuild/tmp/rpm-build/BUILD/tet3-lite-3.7/src/tet3/tcmshlib'
/opt/lsb/bin/lsbcc -I../inc -I../../../inc/tet3 -DINETD -DTET_LITE -DTET_SHLIB -I../tcm/. -I../apishlib/. -O -fPIC -c ../tcm/tcm_main.c
In file included from /opt/lsb/include/stdio.h:6,
                 from ../tcm/tcmhdrs.h:62,
                 from ../tcm/tcm_main.c:178:
/opt/lsb/include/unistd.h:497: error: expected declaration specifiers or ‘...’ before ‘__gid_t’
make[3]: *** [tcm_main.o] Error 1
make[3]: Leaving directory `/nethome/autobuild/tmp/rpm-build/BUILD/tet3-lite-3.7/src/tet3/tcmshlib'
tcmsthrhlib(C++):
make[3]: Entering directory `/nethome/autobuild/tmp/rpm-build/BUILD/tet3-lite-3.7/src/tet3/tcmthrshlib'
/opt/lsb/bin/lsbcc -I../inc -I../../../inc/tet3 -DINETD -DTET_LITE -DTET_THREADS -DTET_SHLIB -I../tcm/. -I../apithrshlib/. -D_REENTRANT -DTET_POSIX_THREADS -c ../tcm/tcm_main.c
In file included from /opt/lsb/include/stdio.h:6,
                 from ../tcm/tcmhdrs.h:62,
                 from ../tcm/tcm_main.c:178:
/opt/lsb/include/unistd.h:497: error: expected declaration specifiers or ‘...’ before ‘__gid_t’
make[3]: *** [tcm_main.o] Error 1
make[3]: Leaving directory `/nethome/autobuild/tmp/rpm-build/BUILD/tet3-lite-3.7/src/tet3/tcmthrshlib'
grw:
make[3]: Entering directory `/nethome/autobuild/tmp/rpm-build/BUILD/tet3-lite-3.7/src/tet3/grw'
/opt/lsb/bin/lsbcc -I../inc -I../../../inc/tet3 -D_POSIX_SOURCE  -DTET_LITE  -O -fPIC -c formatter.c
In file included from /opt/lsb/include/stdio.h:6,
                 from formatter.c:94:
/opt/lsb/include/unistd.h:497: error: expected declaration specifiers or ‘...’ before ‘__gid_t’
make[3]: *** [formatter.o] Error 1
make[3]: Leaving directory `/nethome/autobuild/tmp/rpm-build/BUILD/tet3-lite-3.7/src/tet3/grw'
make[2]: *** [install] Error 2
make[2]: Leaving directory `/nethome/autobuild/tmp/rpm-build/BUILD/tet3-lite-3.7/src/tet3'
xpg3sh/api...
make[2]: Entering directory `/nethome/autobuild/tmp/rpm-build/BUILD/tet3-lite-3.7/src/xpg3sh/api'
sed -e 's/STD_SIGNAL_LIST/1 2 3 4 6 8 13 14 15 10 12 20 18 21 22/' \
    -e 's/SPEC_SIGNAL_LIST/9 17 19 11/' \
    -e 's/NSIG_MARKER/32/' \
    tcm.sh > ../../../lib/xpg3sh/tcm.sh
cp tetapi.sh ../../../lib/xpg3sh
chmod 755 ../../../lib/xpg3sh/tcm.sh ../../../lib/xpg3sh/tetapi.sh
make[2]: Leaving directory `/nethome/autobuild/tmp/rpm-build/BUILD/tet3-lite-3.7/src/xpg3sh/api'
ksh/api...
make[2]: Entering directory `/nethome/autobuild/tmp/rpm-build/BUILD/tet3-lite-3.7/src/ksh/api'
sed -e 's/STD_SIGNAL_LIST/1 2 3 4 6 8 13 14 15 10 12 20 18 21 22/' \
    -e 's/SPEC_SIGNAL_LIST/9 17 19 11/' \
    -e 's/TET_NSIG_NUM/32/' \
    tcm.ksh > ../../../lib/ksh/tcm.ksh
cp tetapi.ksh ../../../lib/ksh
chmod 755 ../../../lib/ksh/tcm.ksh ../../../lib/ksh/tetapi.ksh
make[2]: Leaving directory `/nethome/autobuild/tmp/rpm-build/BUILD/tet3-lite-3.7/src/ksh/api'
posix_sh/api...
make[2]: Entering directory `/nethome/autobuild/tmp/rpm-build/BUILD/tet3-lite-3.7/src/posix_sh/api'
rm -f ../../../lib/posix_sh/tcm.sh
cp tcm.gen ../../../lib/posix_sh/tcm.sh
chmod a-w,a+x ../../../lib/posix_sh/tcm.sh
rm -f ../../../lib/posix_sh/tetapi.sh
cp tetapi.sh ../../../lib/posix_sh/tetapi.sh
chmod a-w,a+x ../../../lib/posix_sh/tetapi.sh
make[2]: Leaving directory `/nethome/autobuild/tmp/rpm-build/BUILD/tet3-lite-3.7/src/posix_sh/api'
scripts...
make[2]: Entering directory `/nethome/autobuild/tmp/rpm-build/BUILD/tet3-lite-3.7/src/scripts'
rm -f ../../bin/tet_start
cp tet_start ../../bin/tet_start
chmod a-w,a+x ../../bin/tet_start
make[2]: Leaving directory `/nethome/autobuild/tmp/rpm-build/BUILD/tet3-lite-3.7/src/scripts'
perl...
make[2]: Entering directory `/nethome/autobuild/tmp/rpm-build/BUILD/tet3-lite-3.7/src/perl'
rm -f ../../lib/perl/tcm.pl
cp tcm.pl ../../lib/perl/tcm.pl
chmod a-w ../../lib/perl/tcm.pl
rm -f ../../lib/perl/api.pl
cp api.pl ../../lib/perl/api.pl
chmod a-w ../../lib/perl/api.pl
rm -f ../../lib/perl/README
cp README ../../lib/perl/README
chmod a-w ../../lib/perl/README
make[2]: Leaving directory `/nethome/autobuild/tmp/rpm-build/BUILD/tet3-lite-3.7/src/perl'
make[1]: Leaving directory `/nethome/autobuild/tmp/rpm-build/BUILD/tet3-lite-3.7/src'
+ cd ..
+ sed -i s@/usr/include/python2.2@/usr/include/python2.4 at g contrib/python_api/Makefile
+ cd contrib/python_api
+ make
make[1]: Entering directory `/nethome/autobuild/tmp/rpm-build/BUILD/tet3-lite-3.7/contrib/python_api'
/opt/lsb/bin/lsbcc -D_POSIX_SOURCE -DTET_LITE -O -fPIC -I/usr/include/python2.4 -c pytet_wrap.c
warning: dangerous include path /usr/include/python2.4
In file included from /opt/lsb/include/stdio.h:6,
                 from /usr/include/python2.4/Python.h:32,
                 from pytet_wrap.c:13:
/opt/lsb/include/unistd.h:497: error: expected declaration specifiers or ‘...’ before ‘__gid_t’
make[1]: *** [pytet_wrap.o] Error 1
make[1]: Leaving directory `/nethome/autobuild/tmp/rpm-build/BUILD/tet3-lite-3.7/contrib/python_api'
error: Bad exit status from /var/tmp/rpm-tmp.59645 (%build)


RPM build errors:
    Bad exit status from /var/tmp/rpm-tmp.59645 (%build)
expect: spawn id exp3 not open
    while executing
"expect "exit 0""
send: spawn id exp3 not open
    while executing
"send "\n""
mv: cannot stat `/nethome/autobuild/tmp/rpm-build/SRPMS/lsb-tet3-lite-3.7-12.lsb4.src.rpm': No such file or directory
make: *** [lsb-tet3-lite-3.7-12.lsb4.src.rpm] Error 1


More information about the lsb-messages mailing list