[Lsb-messages] Build failure for olver-core-tests on ppc64

lsb-autobuild at freestandards.org lsb-autobuild at freestandards.org
Thu Oct 30 01:24:56 PDT 2008


This is an automated message generated when a build failure occurs

Linux lfdev-power64 2.6.18-6-powerpc64 #1 SMP Tue Aug 19 11:59:49 UTC 2008 ppc64 ppc64 ppc64 GNU/Linux
Failed to make packages for olver-core-tests
bzr export  olver-core /nethome/autobuild/tmp/LSBauto/olver-core-tests
Checking build prerequisites...
Ok
Building handbook ...
make[1]: Entering directory `/nethome/autobuild/tmp/LSBauto/olver-core-tests/package/olver-core/config'
Makefile:78: external/PCCTS/h/AParser.d: No such file or directory
Makefile:78: external/PCCTS/h/ASTBase.d: No such file or directory
Makefile:78: external/PCCTS/h/ATokenBuffer.d: No such file or directory
Makefile:78: external/PCCTS/h/BufFileInput.d: No such file or directory
Makefile:78: external/PCCTS/h/DLexerBase.d: No such file or directory
Makefile:78: external/PCCTS/h/PCCTSAST.d: No such file or directory
Makefile:78: external/PCCTS/h/slist.d: No such file or directory
Makefile:78: src/deptree/deptreecommon.d: No such file or directory
Makefile:78: src/deptree/DepTree.d: No such file or directory
Makefile:78: src/deptree/DepTreeParserExt.d: No such file or directory
Makefile:78: src/deptree/DepTreeReader.d: No such file or directory
Makefile:78: src/deptree/DepTreeXMLWriter.d: No such file or directory
Makefile:78: src/handbook/CmdLineOptions.d: No such file or directory
Makefile:78: src/handbook/handbook.d: No such file or directory
Makefile:78: src/configuration/ConfigFile.d: No such file or directory
Makefile:78: src/configuration/ConfigReader.d: No such file or directory
Makefile:78: src/configuration/ConfigWriter.d: No such file or directory
Makefile:78: src/testplan/TestPlan.d: No such file or directory
Makefile:78: src/testplan/TestPlanReader.d: No such file or directory
Makefile:78: src/configprocessor/ConfigProcessor.d: No such file or directory
Makefile:78: src/testplanprocessor/TestPlanProcessor.d: No such file or directory
make[2]: Entering directory `/nethome/autobuild/tmp/LSBauto/olver-core-tests/package/olver-core/config/external/PCCTS/antlr'
cc -O -I. -I../support/set -I../h -DUSER_ZZSYN  -DZZLEXBUFSIZE=32000   -c -o antlr.o antlr.c
cc -O -I. -I../support/set -I../h -DUSER_ZZSYN  -DZZLEXBUFSIZE=32000   -c -o scan.o scan.c
cc -O -I. -I../support/set -I../h -DUSER_ZZSYN  -DZZLEXBUFSIZE=32000   -c -o err.o err.c
cc -O -I. -I../support/set -I../h -DUSER_ZZSYN  -DZZLEXBUFSIZE=32000   -c -o bits.o bits.c
cc -O -I. -I../support/set -I../h -DUSER_ZZSYN  -DZZLEXBUFSIZE=32000   -c -o build.o build.c
cc -O -I. -I../support/set -I../h -DUSER_ZZSYN  -DZZLEXBUFSIZE=32000   -c -o fset2.o fset2.c
cc -O -I. -I../support/set -I../h -DUSER_ZZSYN  -DZZLEXBUFSIZE=32000   -c -o fset.o fset.c
cc -O -I. -I../support/set -I../h -DUSER_ZZSYN  -DZZLEXBUFSIZE=32000   -c -o gen.o gen.c
cc -O -I. -I../support/set -I../h -DUSER_ZZSYN  -DZZLEXBUFSIZE=32000   -c -o globals.o globals.c
cc -O -I. -I../support/set -I../h -DUSER_ZZSYN  -DZZLEXBUFSIZE=32000   -c -o hash.o hash.c
cc -O -I. -I../support/set -I../h -DUSER_ZZSYN  -DZZLEXBUFSIZE=32000   -c -o lex.o lex.c
cc -O -I. -I../support/set -I../h -DUSER_ZZSYN  -DZZLEXBUFSIZE=32000   -c -o main.o main.c
cc -O -I. -I../support/set -I../h -DUSER_ZZSYN  -DZZLEXBUFSIZE=32000   -c -o misc.o misc.c
cc -O -I. -I../support/set -I../h -DUSER_ZZSYN  -DZZLEXBUFSIZE=32000 -c -o set.o ../support/set/set.c
cc -O -I. -I../support/set -I../h -DUSER_ZZSYN  -DZZLEXBUFSIZE=32000   -c -o pred.o pred.c
cc -O -I. -I../support/set -I../h -DUSER_ZZSYN  -DZZLEXBUFSIZE=32000   -c -o egman.o egman.c
cc -O -I. -I../support/set -I../h -DUSER_ZZSYN  -DZZLEXBUFSIZE=32000   -c -o mrhoist.o mrhoist.c
cc -O -I. -I../support/set -I../h -DUSER_ZZSYN  -DZZLEXBUFSIZE=32000   -c -o fcache.o fcache.c
cc -O -I. -I../support/set -I../h -DUSER_ZZSYN  -DZZLEXBUFSIZE=32000 -o antlr antlr.o scan.o err.o bits.o build.o fset2.o fset.o gen.o globals.o hash.o lex.o main.o misc.o set.o pred.o egman.o mrhoist.o fcache.o
mv antlr ../bin/.
make[2]: Leaving directory `/nethome/autobuild/tmp/LSBauto/olver-core-tests/package/olver-core/config/external/PCCTS/antlr'
make[2]: Entering directory `/nethome/autobuild/tmp/LSBauto/olver-core-tests/package/olver-core/config/external/PCCTS/dlg'
cc -O -I. -I../support/set -I../h -DUSER_ZZSYN -DZZLEXBUFSIZE=32000 -c dlg_p.c
cc -O -I. -I../support/set -I../h -DUSER_ZZSYN -DZZLEXBUFSIZE=32000 -c dlg_a.c
cc -O -I. -I../support/set -I../h -DUSER_ZZSYN -DZZLEXBUFSIZE=32000 -c main.c
cc -O -I. -I../support/set -I../h -DUSER_ZZSYN -DZZLEXBUFSIZE=32000   -c -o err.o err.c
cc -c -O -I. -I../support/set -I../h -DUSER_ZZSYN -DZZLEXBUFSIZE=32000 ../support/set/set.c
cc -O -I. -I../support/set -I../h -DUSER_ZZSYN -DZZLEXBUFSIZE=32000   -c -o support.o support.c
cc -O -I. -I../support/set -I../h -DUSER_ZZSYN -DZZLEXBUFSIZE=32000   -c -o output.o output.c
cc -O -I. -I../support/set -I../h -DUSER_ZZSYN -DZZLEXBUFSIZE=32000   -c -o relabel.o relabel.c
cc -O -I. -I../support/set -I../h -DUSER_ZZSYN -DZZLEXBUFSIZE=32000   -c -o automata.o automata.c
cc -O -I. -I../support/set -I../h -DUSER_ZZSYN -DZZLEXBUFSIZE=32000 -o dlg dlg_p.o dlg_a.o main.o err.o set.o support.o output.o relabel.o automata.o
mv dlg ../bin/.
make[2]: Leaving directory `/nethome/autobuild/tmp/LSBauto/olver-core-tests/package/olver-core/config/external/PCCTS/dlg'
./external/PCCTS/bin/antlr -CC ./src/deptree/deptreegrammar.g -o ./src/deptree -ft dtokens.h  -nopurify
Antlr parser generator   Version 1.33MR33   1989-2001
./external/PCCTS/bin/dlg -CC -C1 -i -ci ./src/deptree/parser.dlg -o ./src/deptree -cl DDlgLexer
dlg  Version 1.33MR33   1989-2001

make[1]: Leaving directory `/nethome/autobuild/tmp/LSBauto/olver-core-tests/package/olver-core/config'
make[1]: Entering directory `/nethome/autobuild/tmp/LSBauto/olver-core-tests/package/olver-core/config'
Makefile:78: src/deptree/DDlgLexer.d: No such file or directory
Makefile:78: src/deptree/deptreegrammar.d: No such file or directory
Makefile:78: src/deptree/DepTreeParser.d: No such file or directory
make[1]: Leaving directory `/nethome/autobuild/tmp/LSBauto/olver-core-tests/package/olver-core/config'
make[1]: Entering directory `/nethome/autobuild/tmp/LSBauto/olver-core-tests/package/olver-core/config'
g++ -I ./external/PCCTS/h -I ./src -g -c -O0 -Wno-deprecated -fPIC external/PCCTS/h/AParser.cpp -o external/PCCTS/h/AParser.o
g++ -I ./external/PCCTS/h -I ./src -g -c -O0 -Wno-deprecated -fPIC external/PCCTS/h/ASTBase.cpp -o external/PCCTS/h/ASTBase.o
g++ -I ./external/PCCTS/h -I ./src -g -c -O0 -Wno-deprecated -fPIC external/PCCTS/h/ATokenBuffer.cpp -o external/PCCTS/h/ATokenBuffer.o
g++ -I ./external/PCCTS/h -I ./src -g -c -O0 -Wno-deprecated -fPIC external/PCCTS/h/BufFileInput.cpp -o external/PCCTS/h/BufFileInput.o
g++ -I ./external/PCCTS/h -I ./src -g -c -O0 -Wno-deprecated -fPIC external/PCCTS/h/DLexerBase.cpp -o external/PCCTS/h/DLexerBase.o
g++ -I ./external/PCCTS/h -I ./src -g -c -O0 -Wno-deprecated -fPIC external/PCCTS/h/PCCTSAST.cpp -o external/PCCTS/h/PCCTSAST.o
g++ -I ./external/PCCTS/h -I ./src -g -c -O0 -Wno-deprecated -fPIC external/PCCTS/h/slist.cpp -o external/PCCTS/h/slist.o
g++ -shared -o ./bin/libpccts.so ./external/PCCTS/h/AParser.o ./external/PCCTS/h/ASTBase.o ./external/PCCTS/h/ATokenBuffer.o ./external/PCCTS/h/BufFileInput.o ./external/PCCTS/h/DLexerBase.o ./external/PCCTS/h/PCCTSAST.o ./external/PCCTS/h/slist.o
g++ -I ./external/PCCTS/h -I ./src -g -c -O0 -Wno-deprecated -fPIC src/deptree/DDlgLexer.cpp -o src/deptree/DDlgLexer.o
src/deptree/DDlgLexer.cpp:279: warning: large integer implicitly truncated to unsigned type
src/deptree/DDlgLexer.cpp:335: warning: large integer implicitly truncated to unsigned type
src/deptree/DDlgLexer.cpp:398: warning: large integer implicitly truncated to unsigned type
src/deptree/DDlgLexer.cpp:461: warning: large integer implicitly truncated to unsigned type
g++ -I ./external/PCCTS/h -I ./src -g -c -O0 -Wno-deprecated -fPIC src/deptree/deptreecommon.cpp -o src/deptree/deptreecommon.o
g++ -I ./external/PCCTS/h -I ./src -g -c -O0 -Wno-deprecated -fPIC src/deptree/DepTree.cpp -o src/deptree/DepTree.o
g++ -I ./external/PCCTS/h -I ./src -g -c -O0 -Wno-deprecated -fPIC src/deptree/deptreegrammar.cpp -o src/deptree/deptreegrammar.o
g++ -I ./external/PCCTS/h -I ./src -g -c -O0 -Wno-deprecated -fPIC src/deptree/DepTreeParser.cpp -o src/deptree/DepTreeParser.o
g++ -I ./external/PCCTS/h -I ./src -g -c -O0 -Wno-deprecated -fPIC src/deptree/DepTreeParserExt.cpp -o src/deptree/DepTreeParserExt.o
g++ -I ./external/PCCTS/h -I ./src -g -c -O0 -Wno-deprecated -fPIC src/deptree/DepTreeReader.cpp -o src/deptree/DepTreeReader.o
g++ -I ./external/PCCTS/h -I ./src -g -c -O0 -Wno-deprecated -fPIC src/deptree/DepTreeXMLWriter.cpp -o src/deptree/DepTreeXMLWriter.o
src/deptree/DepTreeXMLWriter.cpp:135:2: warning: no newline at end of file
g++ -shared -o ./bin/libdeptree.so ./src/deptree/DDlgLexer.o ./src/deptree/deptreecommon.o ./src/deptree/DepTree.o ./src/deptree/deptreegrammar.o ./src/deptree/DepTreeParser.o ./src/deptree/DepTreeParserExt.o ./src/deptree/DepTreeReader.o ./src/deptree/DepTreeXMLWriter.o
g++ -I ./external/PCCTS/h -I ./src -g -c -O0 -Wno-deprecated -fPIC src/configuration/ConfigFile.cpp -o src/configuration/ConfigFile.o
g++ -I ./external/PCCTS/h -I ./src -g -c -O0 -Wno-deprecated -fPIC src/configuration/ConfigReader.cpp -o src/configuration/ConfigReader.o
g++ -I ./external/PCCTS/h -I ./src -g -c -O0 -Wno-deprecated -fPIC src/configuration/ConfigWriter.cpp -o src/configuration/ConfigWriter.o
g++ -shared -o ./bin/libconfiguration.so ./src/configuration/ConfigFile.o ./src/configuration/ConfigReader.o ./src/configuration/ConfigWriter.o
g++ -I ./external/PCCTS/h -I ./src -g -c -O0 -Wno-deprecated -fPIC src/testplan/TestPlan.cpp -o src/testplan/TestPlan.o
g++ -I ./external/PCCTS/h -I ./src -g -c -O0 -Wno-deprecated -fPIC src/testplan/TestPlanReader.cpp -o src/testplan/TestPlanReader.o
src/testplan/TestPlanReader.cpp:56:2: warning: no newline at end of file
g++ -shared -o ./bin/libtestplan.so ./src/testplan/TestPlan.o ./src/testplan/TestPlanReader.o
g++ -I ./external/PCCTS/h -I ./src -g -c -O0 -Wno-deprecated -fPIC src/handbook/CmdLineOptions.cpp -o src/handbook/CmdLineOptions.o
g++ -I ./external/PCCTS/h -I ./src -g -c -O0 -Wno-deprecated -fPIC src/handbook/handbook.cpp -o src/handbook/handbook.o
g++ -o ./bin/handbook ./src/handbook/CmdLineOptions.o ./src/handbook/handbook.o -L ./bin -ldeptree -lconfiguration -ltestplan -lpccts
g++ -I ./external/PCCTS/h -I ./src -g -c -O0 -Wno-deprecated -fPIC src/configprocessor/ConfigProcessor.cpp -o src/configprocessor/ConfigProcessor.o
g++ -o ./bin/configprocessor ./src/configprocessor/ConfigProcessor.o -L ./bin -lconfiguration
g++ -I ./external/PCCTS/h -I ./src -g -c -O0 -Wno-deprecated -fPIC src/testplanprocessor/TestPlanProcessor.cpp -o src/testplanprocessor/TestPlanProcessor.o
g++ -o ./bin/testplanprocessor ./src/testplanprocessor/TestPlanProcessor.o -L ./bin -ltestplan
Build completed
make[1]: Leaving directory `/nethome/autobuild/tmp/LSBauto/olver-core-tests/package/olver-core/config'
Generating configuration files ...
Making default configuration "../../config/default.conf"...
Ok
Generating headers...
Replacing ./config/config_loader_gen.h... Ok.
Replacing ./config/test_system_config.c... Ok.
Replacing ./config/test_system_config.h... Ok.
Replacing ./data/errno_config.c... Ok.
Replacing ./data/errno_config.h... Ok.
Replacing ./data/signal_config.c... Ok.
Replacing ./data/signal_config.h... Ok.
Replacing ./fs/dir/dir_config.c... Ok.
Replacing ./fs/dir/dir_config.h... Ok.
Replacing ./fs/fifo/fifo_config.c... Ok.
Replacing ./fs/fifo/fifo_config.h... Ok.
Replacing ./fs/fs/fs_config.c... Ok.
Replacing ./fs/fs/fs_config.h... Ok.
Replacing ./fs/ftw/ftw_config.c... Ok.
Replacing ./fs/ftw/ftw_config.h... Ok.
Replacing ./fs/glob/glob_config.c... Ok.
Replacing ./fs/glob/glob_config.h... Ok.
Replacing ./fs/meta/access_config.c... Ok.
Replacing ./fs/meta/access_config.h... Ok.
Replacing ./fs/meta/meta_config.c... Ok.
Replacing ./fs/meta/meta_config.h... Ok.
Replacing ./fs/meta/statvfs_config.c... Ok.
Replacing ./fs/meta/statvfs_config.h... Ok.
Replacing ./fs/name/name_config.c... Ok.
Replacing ./fs/name/name_config.h... Ok.
Replacing ./fs/symlink/symlink_config.c... Ok.
Replacing ./fs/symlink/symlink_config.h... Ok.
Replacing ./fs/tmpfile/tmpfile_config.c... Ok.
Replacing ./fs/tmpfile/tmpfile_config.h... Ok.
Replacing ./io/file/file_config.c... Ok.
Replacing ./io/file/file_config.h... Ok.
Replacing ./io/fstream/buffer_config.c... Ok.
Replacing ./io/fstream/buffer_config.h... Ok.
Replacing ./io/fstream/fstream_config.c... Ok.
Replacing ./io/fstream/fstream_config.h... Ok.
Replacing ./io/fstream/wstream_config.c... Ok.
Replacing ./io/fstream/wstream_config.h... Ok.
Replacing ./io/multiplex/multiplex_config.c... Ok.
Replacing ./io/multiplex/multiplex_config.h... Ok.
Replacing ./io/pipe/pipe_config.c... Ok.
Replacing ./io/pipe/pipe_config.h... Ok.
Replacing ./io/term/term_config.c... Ok.
Replacing ./io/term/term_config.h... Ok.
Replacing ./locale/collate/collate_config.c... Ok.
Replacing ./locale/collate/collate_config.h... Ok.
Replacing ./locale/iconv/iconv_config.c... Ok.
Replacing ./locale/iconv/iconv_config.h... Ok.
Replacing ./locale/locale/locale_config.c... Ok.
Replacing ./locale/locale/locale_config.h... Ok.
Replacing ./locale/messages/messages_config.c... Ok.
Replacing ./locale/messages/messages_config.h... Ok.
Replacing ./locale/nlcat/nlcat_config.c... Ok.
Replacing ./locale/nlcat/nlcat_config.h... Ok.
Replacing ./locale/textdomain/textdomain_config.c... Ok.
Replacing ./locale/textdomain/textdomain_config.h... Ok.
Replacing ./locale/wcollate/wcollate_config.c... Ok.
Replacing ./locale/wcollate/wcollate_config.h... Ok.
Replacing ./locale/wctrans/wctrans_config.c... Ok.
Replacing ./locale/wctrans/wctrans_config.h... Ok.
Replacing ./math/bessel/bessel_config.c... Ok.
Replacing ./math/bessel/bessel_config.h... Ok.
Replacing ./math/error/error_config.c... Ok.
Replacing ./math/error/error_config.h... Ok.
Replacing ./math/exp/exp_config.c... Ok.
Replacing ./math/exp/exp_config.h... Ok.
Replacing ./math/gamma/gamma_config.c... Ok.
Replacing ./math/gamma/gamma_config.h... Ok.
Replacing ./math/hyper/hyper_config.c... Ok.
Replacing ./math/hyper/hyper_config.h... Ok.
Replacing ./math/math/math_config.c... Ok.
Replacing ./math/math/math_config.h... Ok.
Replacing ./math/real/real_config.c... Ok.
Replacing ./math/real/real_config.h... Ok.
Replacing ./math/trig/trig_config.c... Ok.
Replacing ./math/trig/trig_config.h... Ok.
Replacing ./memory/break/break_config.c... Ok.
Replacing ./memory/break/break_config.h... Ok.
Replacing ./memory/heap/heap_config.c... Ok.
Replacing ./memory/heap/heap_config.h... Ok.
Replacing ./memory/mman/mman_config.c... Ok.
Replacing ./memory/mman/mman_config.h... Ok.
Replacing ./ncurses/ncurses/ncurses_config.c... Ok.
Replacing ./ncurses/ncurses/ncurses_config.h... Ok.
Replacing ./process/context/context_config.c... Ok.
Replacing ./process/context/context_config.h... Ok.
Replacing ./process/environ/environ_config.c... Ok.
Replacing ./process/environ/environ_config.h... Ok.
Replacing ./process/fenv/fenv_config.c... Ok.
Replacing ./process/fenv/fenv_config.h... Ok.
Replacing ./process/ipc/ipc_config.c... Ok.
Replacing ./process/ipc/ipc_config.h... Ok.
Replacing ./process/ipc/msg_config.c... Ok.
Replacing ./process/ipc/msg_config.h... Ok.
Replacing ./process/ipc/sem_config.c... Ok.
Replacing ./process/ipc/sem_config.h... Ok.
Replacing ./process/ipc/shm_config.c... Ok.
Replacing ./process/ipc/shm_config.h... Ok.
Replacing ./process/meta/meta_fs_config.c... Ok.
Replacing ./process/meta/meta_fs_config.h... Ok.
Replacing ./process/meta/meta_user_config.c... Ok.
Replacing ./process/meta/meta_user_config.h... Ok.
Replacing ./process/meta/nice_config.c... Ok.
Replacing ./process/meta/nice_config.h... Ok.
Replacing ./process/pgroup/pgroup_config.c... Ok.
Replacing ./process/pgroup/pgroup_config.h... Ok.
Replacing ./process/process/process_config.c... Ok.
Replacing ./process/process/process_config.h... Ok.
Replacing ./process/resources/resources_config.c... Ok.
Replacing ./process/resources/resources_config.h... Ok.
Replacing ./process/scheduler/process_scheduler_config.c... Ok.
Replacing ./process/scheduler/process_scheduler_config.h... Ok.
Replacing ./pthread/attr/attr_config.c... Ok.
Replacing ./pthread/attr/attr_config.h... Ok.
Replacing ./pthread/cond/cond_config.c... Ok.
Replacing ./pthread/cond/cond_config.h... Ok.
Replacing ./pthread/cond/condattr_config.c... Ok.
Replacing ./pthread/cond/condattr_config.h... Ok.
Replacing ./pthread/mutex/mutex_config.c... Ok.
Replacing ./pthread/mutex/mutex_config.h... Ok.
Replacing ./pthread/mutex/mutexattr_config.c... Ok.
Replacing ./pthread/mutex/mutexattr_config.h... Ok.
Replacing ./pthread/pthread/pthread_pthread_config.c... Ok.
Replacing ./pthread/pthread/pthread_pthread_config.h... Ok.
Replacing ./pthread/rwlock/rwlock_config.c... Ok.
Replacing ./pthread/rwlock/rwlock_config.h... Ok.
Replacing ./pthread/rwlock/rwlockattr_config.c... Ok.
Replacing ./pthread/rwlock/rwlockattr_config.h... Ok.
Replacing ./pthread/scheduler/scheduler_config.c... Ok.
Replacing ./pthread/scheduler/scheduler_config.h... Ok.
Replacing ./pthread/sem/pthread_sem_config.c... Ok.
Replacing ./pthread/sem/pthread_sem_config.h... Ok.
Replacing ./pthread/tls/tls_config.c... Ok.
Replacing ./pthread/tls/tls_config.h... Ok.
Replacing ./signal/sigaction/sigaction_config.c... Ok.
Replacing ./signal/sigaction/sigaction_config.h... Ok.
Replacing ./signal/sigctrl/sigctrl_config.c... Ok.
Replacing ./signal/sigctrl/sigctrl_config.h... Ok.
Replacing ./signal/sigsend/sigsend_config.c... Ok.
Replacing ./signal/sigsend/sigsend_config.h... Ok.
Replacing ./signal/sigset/sigset_config.c... Ok.
Replacing ./signal/sigset/sigset_config.h... Ok.
Replacing ./signal/sigwait/sigwait_config.c... Ok.
Replacing ./signal/sigwait/sigwait_config.h... Ok.
Replacing ./socket/netdb/netdb_config.c... Ok.
Replacing ./socket/netdb/netdb_config.h... Ok.
Replacing ./socket/rpc/pmap_config.h... Ok.
Replacing ./socket/rpc/xdr_config.c... Ok.
Replacing ./socket/rpc/xdr_config.h... Ok.
Replacing ./socket/socket/socket_config.c... Ok.
Replacing ./socket/socket/socket_config.h... Ok.
Replacing ./system/host/host_config.c... Ok.
Replacing ./system/host/host_config.h... Ok.
Replacing ./system/stat/stat_config.c... Ok.
Replacing ./system/stat/stat_config.h... Ok.
Replacing ./system/sysconf/sysconf_config.c... Ok.
Replacing ./system/sysconf/sysconf_config.h... Ok.
Replacing ./system/user/account_config.c... Ok.
Replacing ./system/user/account_config.h... Ok.
Replacing ./system/user/group_config.c... Ok.
Replacing ./system/user/group_config.h... Ok.
Replacing ./system/user/system_user_config.c... Ok.
Replacing ./system/user/system_user_config.h... Ok.
Replacing ./system/user/user_config.c... Ok.
Replacing ./system/user/user_config.h... Ok.
Replacing ./time/clock/clock_config.c... Ok.
Replacing ./time/clock/clock_config.h... Ok.
Replacing ./time/conversion/conversion_config.c... Ok.
Replacing ./time/conversion/conversion_config.h... Ok.
Replacing ./time/time/time_config.c... Ok.
Replacing ./time/time/time_config.h... Ok.
Replacing ./time/timer/timer_config.c... Ok.
Replacing ./time/timer/timer_config.h... Ok.
Replacing ./util/compress/compress_config.c... Ok.
Replacing ./util/compress/compress_config.h... Ok.
Replacing ./util/conversion/strint_config.c... Ok.
Replacing ./util/conversion/strint_config.h... Ok.
Replacing ./util/conversion/strreal_config.c... Ok.
Replacing ./util/conversion/strreal_config.h... Ok.
Replacing ./util/conversion/wchar_config.c... Ok.
Replacing ./util/conversion/wchar_config.h... Ok.
Replacing ./util/conversion/wstrint_config.c... Ok.
Replacing ./util/conversion/wstrint_config.h... Ok.
Replacing ./util/conversion/wstrreal_config.c... Ok.
Replacing ./util/conversion/wstrreal_config.h... Ok.
Replacing ./util/crypt/crypt_config.c... Ok.
Replacing ./util/crypt/crypt_config.h... Ok.
Replacing ./util/dl/dl_config.c... Ok.
Replacing ./util/dl/dl_config.h... Ok.
Replacing ./util/float/float_config.c... Ok.
Replacing ./util/float/float_config.h... Ok.
Replacing ./util/format/money_config.c... Ok.
Replacing ./util/format/money_config.h... Ok.
Replacing ./util/format/printf_config.c... Ok.
Replacing ./util/format/printf_config.h... Ok.
Replacing ./util/format/scanf_config.c... Ok.
Replacing ./util/format/scanf_config.h... Ok.
Replacing ./util/format/wprintf_config.c... Ok.
Replacing ./util/format/wprintf_config.h... Ok.
Replacing ./util/format/wscanf_config.c... Ok.
Replacing ./util/format/wscanf_config.h... Ok.
Replacing ./util/inet/inet_config.c... Ok.
Replacing ./util/inet/inet_config.h... Ok.
Replacing ./util/pam/pam_config.c... Ok.
Replacing ./util/pam/pam_config.h... Ok.
Replacing ./util/search/hash_config.c... Ok.
Replacing ./util/search/hash_config.h... Ok.
Replacing ./util/search/queue_config.c... Ok.
Replacing ./util/search/queue_config.h... Ok.
Replacing ./util/search/search_config.c... Ok.
Replacing ./util/search/search_config.h... Ok.
Replacing ./util/search/tree_config.c... Ok.
Replacing ./util/search/tree_config.h... Ok.
Replacing ./util/string/str_config.c... Ok.
Replacing ./util/string/str_config.h... Ok.
Replacing ./util/string/wstr_config.c... Ok.
Replacing ./util/string/wstr_config.h... Ok.
Replacing ./util/wordexp/wordexp_config.c... Ok.
Replacing ./util/wordexp/wordexp_config.h... Ok.
Ok
Done
Building test data ...
Building test data for util.dl ...             make[1]: Entering directory `/nethome/autobuild/tmp/LSBauto/olver-core-tests/package/olver-core/src/testdata/util.dl'
gcc lib.c -fPIC -shared -o libmy.so
Build completed
make[1]: Leaving directory `/nethome/autobuild/tmp/LSBauto/olver-core-tests/package/olver-core/src/testdata/util.dl'
Installing test data for locale.nlcat ...      Done
Installing test data for locale.textdomain ... Done
Building agent ...
Checking missing LSB symbols and libraries...
missing
make[1]: Entering directory `/nethome/autobuild/tmp/LSBauto/olver-core-tests/package/olver-core/src/agent'
ERROR: Dropping argument lsbcc
In file included from /opt/lsb/include/fcntl.h:6,
                 from ./config/config.h:25,
                 from ./common/agent.h:23,
                 from common/main.c:21:
/opt/lsb/include/unistd.h:497: error: expected declaration specifiers or ‘...’ before ‘__gid_t’
make[1]: *** [common/main.o] Error 1
make[1]: Leaving directory `/nethome/autobuild/tmp/LSBauto/olver-core-tests/package/olver-core/src/agent'
Building CTesk launcher ...
make[1]: Entering directory `/nethome/autobuild/tmp/LSBauto/olver-core-tests/package/olver-core/tools/CTesK/native-java-launcher'
cc    -c -o src/launcher.o src/launcher.c
cc    -c -o src/config.o src/config.c
cc  -o launcher src/launcher.o src/config.o
make[1]: Leaving directory `/nethome/autobuild/tmp/LSBauto/olver-core-tests/package/olver-core/tools/CTesK/native-java-launcher'
Building CTesk libraries ...
make[1]: Entering directory `/nethome/autobuild/tmp/LSBauto/olver-core-tests/package/olver-core/tools/CTesK/lib/src'
make[1]: Leaving directory `/nethome/autobuild/tmp/LSBauto/olver-core-tests/package/olver-core/tools/CTesK/lib/src'
make[1]: Entering directory `/nethome/autobuild/tmp/LSBauto/olver-core-tests/package/olver-core/tools/CTesK/lib/src'
gcc -I. -g3 -O -c utils/assertion.c -o utils/assertion.o
gcc -I. -g3 -O -c c_tracer/TracerStringBuffer.c -o c_tracer/TracerStringBuffer.o
gcc -I. -g3 -O -c c_tracer/TraceConsoleWriter.c -o c_tracer/TraceConsoleWriter.o
gcc -I. -g3 -O -c c_tracer/TraceFormatter.c -o c_tracer/TraceFormatter.o
gcc -I. -g3 -O -c c_tracer/s_StringBuffer.c -o c_tracer/s_StringBuffer.o
gcc -I. -g3 -O -c c_tracer/TraceWriteController.c -o c_tracer/TraceWriteController.o
gcc -I. -g3 -O -c c_tracer/TraceXMLFormatter.c -o c_tracer/TraceXMLFormatter.o
gcc -I. -g3 -O -c c_tracer/TraceList.c -o c_tracer/TraceList.o
gcc -I. -g3 -O -c c_tracer/TraceWriter.c -o c_tracer/TraceWriter.o
gcc -I. -g3 -O -c c_tracer/TSEnvironment.c -o c_tracer/TSEnvironment.o
c_tracer/TSEnvironment.c: In function ‘DefaultTSEnvironment_getOSInfo’:
c_tracer/TSEnvironment.c:282: warning: cast to pointer from integer of different size
c_tracer/TSEnvironment.c:283: warning: cast to pointer from integer of different size
c_tracer/TSEnvironment.c: In function ‘DefaultTSEnvironment_getHostInfo’:
c_tracer/TSEnvironment.c:292: warning: cast to pointer from integer of different size
c_tracer/TSEnvironment.c:293: warning: cast to pointer from integer of different size
gcc -I. -g3 -O -c c_tracer/TraceBufferWriter.c -o c_tracer/TraceBufferWriter.o
gcc -I. -g3 -O -c c_tracer/TraceMultiWriter.c -o c_tracer/TraceMultiWriter.o
gcc -I. -g3 -O -c c_tracer/Tracer.c -o c_tracer/Tracer.o
gcc -I. -g3 -O -c c_tracer/TraceFileWriter.c -o c_tracer/TraceFileWriter.o
gcc -I. -g3 -O -c c_tracer/TraceConstrainer.c -o c_tracer/TraceConstrainer.o
gcc -I. -g3 -O -c c_tracer/c_tracer.c -o c_tracer/c_tracer.o
gcc -I. -g3 -O -c atl/array.c -o atl/array.o
gcc -I. -g3 -O -c atl/double.c -o atl/double.o
gcc -I. -g3 -O -c atl/integer.c -o atl/integer.o
gcc -I. -g3 -O -c atl/long.c -o atl/long.o
gcc -I. -g3 -O -c atl/set.c -o atl/set.o
gcc -I. -g3 -O -c atl/unit.c -o atl/unit.o
gcc -I. -g3 -O -c atl/char.c -o atl/char.o
gcc -I. -g3 -O -c atl/float.c -o atl/float.o
gcc -I. -g3 -O -c atl/intset.c -o atl/intset.o
gcc -I. -g3 -O -c atl/map.c -o atl/map.o
gcc -I. -g3 -O -c atl/short.c -o atl/short.o
gcc -I. -g3 -O -c atl/void_ast.c -o atl/void_ast.o
gcc -I. -g3 -O -c atl/complex.c -o atl/complex.o
gcc -I. -g3 -O -c atl/hash.c -o atl/hash.o
gcc -I. -g3 -O -c atl/list.c -o atl/list.o
gcc -I. -g3 -O -c atl/object.c -o atl/object.o
gcc -I. -g3 -O -c atl/string.c -o atl/string.o
gcc -I. -g3 -O -c atl/stringbuffer.c -o atl/stringbuffer.o
gcc -I. -g3 -O -c atl/bigint.c -o atl/bigint.o
gcc -I. -g3 -O -c atl/multiset.c -o atl/multiset.o
gcc -I. -g3 -O -c ts/convex.c -o ts/convex.o
gcc -I. -g3 -O -c ts/dfsm.c -o ts/dfsm.o
ts/dfsm.c: In function ‘start_dfsm’:
ts/dfsm.c:813: warning: passing argument 2 of ‘traceScenarioParameters’ from incompatible pointer type
gcc -I. -g3 -O -c ts/dserialization.c -o ts/dserialization.o
gcc -I. -g3 -O -c ts/engine.c -o ts/engine.o
gcc -I. -g3 -O -c ts/generated.c -o ts/generated.o
gcc -I. -g3 -O -c ts/ndfsm.c -o ts/ndfsm.o
ts/ndfsm.c: In function ‘start_ndfsm’:
ts/ndfsm.c:883: warning: passing argument 2 of ‘traceScenarioParameters’ from incompatible pointer type
gcc -I. -g3 -O -c ts/register.c -o ts/register.o
gcc -I. -g3 -O -c ts/serialization.c -o ts/serialization.o
gcc -I. -g3 -O -c ts/system.c -o ts/system.o
gcc -I. -g3 -O -c ts/timemark.c -o ts/timemark.o
gcc -I. -g3 -O -c ts/ts.c -o ts/ts.o
gcc -I. -g3 -O -c ts/coverage.c -o ts/coverage.o
ts/coverage.c: In function ‘ce_coord’:
ts/coverage.c:52: warning: assignment discards qualifiers from pointer target type
ts/coverage.c: In function ‘ce_coord_intern’:
ts/coverage.c:101: warning: assignment discards qualifiers from pointer target type
ar r libctesk.a utils/assertion.o c_tracer/TracerStringBuffer.o c_tracer/TraceConsoleWriter.o c_tracer/TraceFormatter.o c_tracer/s_StringBuffer.o c_tracer/TraceWriteController.o c_tracer/TraceXMLFormatter.o c_tracer/TraceList.o c_tracer/TraceWriter.o c_tracer/TSEnvironment.o c_tracer/TraceBufferWriter.o c_tracer/TraceMultiWriter.o c_tracer/Tracer.o c_tracer/TraceFileWriter.o c_tracer/TraceConstrainer.o c_tracer/c_tracer.o atl/array.o atl/double.o atl/integer.o atl/long.o atl/set.o atl/unit.o atl/char.o atl/float.o atl/intset.o atl/map.o atl/short.o atl/void_ast.o atl/complex.o atl/hash.o atl/list.o atl/object.o atl/string.o atl/stringbuffer.o atl/bigint.o atl/multiset.o ts/convex.o ts/dfsm.o ts/dserialization.o ts/engine.o ts/generated.o ts/ndfsm.o ts/register.o ts/serialization.o ts/system.o ts/timemark.o ts/ts.o ts/coverage.o
ar: creating libctesk.a
ranlib libctesk.a
make[1]: Leaving directory `/nethome/autobuild/tmp/LSBauto/olver-core-tests/package/olver-core/tools/CTesK/lib/src'
Building model ...
make[1]: Entering directory `/nethome/autobuild/tmp/LSBauto/olver-core-tests/package/olver-core/src/model'
make[1]: Leaving directory `/nethome/autobuild/tmp/LSBauto/olver-core-tests/package/olver-core/src/model'
make[1]: Entering directory `/nethome/autobuild/tmp/LSBauto/olver-core-tests/package/olver-core/src/model'
Compiling common/ts_socket.c
Compiling common/verbose.c
Compiling common/explicit_fsm.c
Compiling common/progress_timer.c
Compiling config/test_system_config.c
Compiling data/errno_config.c
Compiling data/signal_config.c
Compiling fs/dir/dir_config.c
Compiling fs/fifo/fifo_config.c
Compiling fs/fs/fs_config.c
Compiling fs/ftw/ftw_config.c
Compiling fs/glob/glob_config.c
Compiling fs/meta/access_config.c
Compiling fs/meta/meta_config.c
Compiling fs/meta/statvfs_config.c
Compiling fs/name/name_config.c
Compiling fs/symlink/symlink_config.c
Compiling fs/tmpfile/tmpfile_config.c
Compiling io/file/file_config.c
Compiling io/term/term_config.c
Compiling io/pipe/pipe_config.c
Compiling io/fstream/buffer_config.c
Compiling io/fstream/fstream_config.c
Compiling io/fstream/wstream_config.c
Compiling io/multiplex/multiplex_config.c
Compiling memory/heap/heap_config.c
Compiling memory/mman/mman_config.c
Compiling memory/break/break_config.c
Compiling process/process/process_config.c
Compiling process/fenv/fenv_config.c
Compiling process/meta/meta_fs_config.c
Compiling process/meta/meta_user_config.c
Compiling process/meta/nice_config.c
Compiling process/environ/environ_config.c
Compiling process/context/context_config.c
Compiling process/ipc/ipc_config.c
Compiling process/ipc/msg_config.c
Compiling process/ipc/sem_config.c
Compiling process/ipc/shm_config.c
Compiling process/pgroup/pgroup_config.c
Compiling process/resources/resources_config.c
Compiling process/scheduler/process_scheduler_config.c
Compiling pthread/mutex/mutexattr_config.c
Compiling pthread/mutex/mutex_config.c
Compiling pthread/pthread/pthread_pthread_config.c
Compiling pthread/attr/attr_config.c
Compiling pthread/rwlock/rwlockattr_config.c
Compiling pthread/rwlock/rwlock_config.c
Compiling pthread/scheduler/scheduler_config.c
Compiling pthread/cond/condattr_config.c
Compiling pthread/cond/cond_config.c
Compiling pthread/sem/pthread_sem_config.c
Compiling pthread/tls/tls_config.c
Compiling system/sysconf/sysconf_config.c
Compiling system/user/account_config.c
Compiling system/user/group_config.c
Compiling system/user/system_user_config.c
Compiling system/user/user_config.c
Compiling system/host/host_config.c
Compiling system/stat/stat_config.c
Compiling util/compress/compress_config.c
Compiling util/conversion/strint_config.c
Compiling util/conversion/strreal_config.c
Compiling util/conversion/wchar_config.c
Compiling util/conversion/wstrint_config.c
Compiling util/conversion/wstrreal_config.c
Compiling util/crypt/crypt_config.c
Compiling util/dl/dl_config.c
Compiling util/float/float_config.c
Compiling util/format/money_config.c
Compiling util/format/printf_config.c
Compiling util/format/scanf_config.c
Compiling util/format/wprintf_config.c
Compiling util/format/wscanf_config.c
Compiling util/inet/inet_config.c
Compiling util/pam/pam_config.c
Compiling util/search/hash_config.c
Compiling util/search/queue_config.c
Compiling util/search/search_config.c
Compiling util/search/tree_config.c
Compiling util/string/str_config.c
Compiling util/string/wstr_config.c
Compiling util/wordexp/wordexp_config.c
Compiling math/bessel/bessel_config.c
Compiling math/error/error_config.c
Compiling math/exp/exp_config.c
Compiling math/gamma/gamma_config.c
Compiling math/hyper/hyper_config.c
Compiling math/math/math_config.c
Compiling math/real/real_config.c
Compiling math/trig/trig_config.c
Compiling locale/collate/collate_config.c
Compiling locale/iconv/iconv_config.c
Compiling locale/locale/locale_config.c
Compiling locale/messages/messages_config.c
Compiling locale/nlcat/nlcat_config.c
Compiling locale/textdomain/textdomain_config.c
Compiling locale/wcollate/wcollate_config.c
Compiling locale/wctrans/wctrans_config.c
Compiling signal/sigaction/sigaction_config.c
Compiling signal/sigctrl/sigctrl_config.c
Compiling signal/sigsend/sigsend_config.c
Compiling signal/sigset/sigset_config.c
Compiling signal/sigwait/sigwait_config.c
Compiling socket/netdb/netdb_config.c
Compiling socket/rpc/xdr_config.c
Compiling socket/socket/socket_config.c
Compiling time/clock/clock_config.c
Compiling time/conversion/convertionAlgorithms.c
Compiling time/conversion/conversion_config.c
Compiling time/time/time_config.c
Compiling time/timer/timer_config.c
Compiling ncurses/ncurses/ncurses_config.c
Translating file common/cbytearray.sec...
Translating file common/common_media.sec...
Translating file common/common_model.sec...
Translating file common/common_scenario.sec...
Translating file common/control_center.sec...
Translating file common/coverages.sec...
Translating file common/cstring.sec...
Translating file common/init.sec...
Translating file common/main.sec...
Translating file common/pointer.sec...
Translating file common/tree.sec...
Translating file common/tsstream.sec...
Translating file common/wchararray.sec...
Translating file common/wstring.sec...
Translating file config/config_loader.sec...
Translating file config/interpretation.sec...
config/interpretation.sec:102:2: warning: no newline at end of file
Translating file config/pthread_config.sec...
Translating file config/system_config.sec...
Translating file config/type_config.sec...
Translating file core/core.sec...
Translating file data/basis.sec...
Translating file data/embed_model.sec...
Translating file data/locale_model.sec...
Translating file data/signal_model.sec...
Translating file data/time_model.sec...
Translating file data/wchar_model.sec...
Translating file data/sys/timeb_model.sec...
Translating file data/sys/time_model.sec...
Translating file fs/dir/dir_media.sec...
Translating file fs/dir/dir_model.sec...
Translating file fs/dir/tests/dir_main.sec...
Translating file fs/dir/tests/dir_scenario.sec...
Translating file fs/dir/tests/fs_dump.sec...
Translating file fs/fifo/fifo_media.sec...
Translating file fs/fifo/fifo_model.sec...
Translating file fs/fifo/tests/fifo_main.sec...
Translating file fs/fifo/tests/fifo_scenario.sec...
Translating file fs/fs/fs_media.sec...
Translating file fs/fs/fs_model.sec...
Translating file fs/fs/tests/fs_main.sec...
Translating file fs/fs/tests/fs_scenario.sec...
Translating file fs/ftw/ftw_media.sec...
Translating file fs/ftw/ftw_model.sec...
Translating file fs/ftw/tests/ftw_main.sec...
Translating file fs/ftw/tests/ftw_scenario.sec...
Translating file fs/glob/glob_media.sec...
Translating file fs/glob/glob_model.sec...
Translating file fs/glob/tests/glob_main.sec...
Translating file fs/glob/tests/glob_scenario.sec...
Translating file fs/meta/access_media.sec...
Translating file fs/meta/access_model.sec...
Translating file fs/meta/meta_media.sec...
Translating file fs/meta/meta_model.sec...
Translating file fs/meta/statvfs_media.sec...
Translating file fs/meta/statvfs_model.sec...
Translating file fs/meta/tests/access_scenario.sec...
Translating file fs/meta/tests/fs_meta_common_scenario.sec...
Translating file fs/meta/tests/meta_main.sec...
Translating file fs/meta/tests/meta_scenario.sec...
Translating file fs/meta/tests/statvfs_scenario.sec...
Translating file fs/name/name_media.sec...
Translating file fs/name/name_model.sec...
Translating file fs/name/tests/name_main.sec...
Translating file fs/name/tests/name_scenario.sec...
Translating file fs/symlink/symlink_media.sec...
Translating file fs/symlink/symlink_model.sec...
Translating file fs/symlink/tests/symlink_main.sec...
Translating file fs/symlink/tests/symlink_scenario.sec...
Translating file fs/tmpfile/tmpfile_media.sec...
Translating file fs/tmpfile/tmpfile_model.sec...
Translating file fs/tmpfile/tests/tmpfile_main.sec...
Translating file fs/tmpfile/tests/tmpfile_scenario.sec...
Translating file io/file/file_media.sec...
Translating file io/file/file_model.sec...
Translating file io/file/tests/file_lock_scenario.sec...
Translating file io/file/tests/file_main.sec...
Translating file io/file/tests/file_scenario.sec...
Translating file io/term/term_media.sec...
Translating file io/term/term_model.sec...
Translating file io/term/tests/cf_scenario.sec...
Translating file io/term/tests/cterm_scenario.sec...
Translating file io/term/tests/open_tty_scenario.sec...
Translating file io/term/tests/pt_scenario.sec...
Translating file io/term/tests/rw_canon_scenario.sec...
Translating file io/term/tests/rw_case_a_scenario.sec...
Translating file io/term/tests/rw_case_b_scenario.sec...
Translating file io/term/tests/rw_case_c_scenario.sec...
Translating file io/term/tests/rw_case_d_scenario.sec...
Translating file io/term/tests/tcpgrp_scenario.sec...
Translating file io/term/tests/tc_scenario.sec...
Translating file io/term/tests/term_main.sec...
Translating file io/term/tests/term_scenario.sec...
Translating file io/term/tests/tty_scenario.sec...
Translating file io/pipe/pipe_media.sec...
Translating file io/pipe/pipe_model.sec...
Translating file io/pipe/tests/pipe_main.sec...
Translating file io/pipe/tests/pipe_scenario.sec...
Translating file io/fstream/buffer_media.sec...
Translating file io/fstream/buffer_model.sec...
Translating file io/fstream/fstream_media.sec...
Translating file io/fstream/fstream_model.sec...
Translating file io/fstream/lock_media.sec...
Translating file io/fstream/lock_model.sec...
Translating file io/fstream/wstream_media.sec...
Translating file io/fstream/wstream_model.sec...
Translating file io/fstream/tests/buffer_scenario.sec...
Translating file io/fstream/tests/fstream_main.sec...
Translating file io/fstream/tests/fstream_scenario.sec...
Translating file io/fstream/tests/lock_scenario.sec...
Translating file io/fstream/tests/wstream_scenario.sec...
Translating file io/multiplex/multiplex_media.sec...
Translating file io/multiplex/multiplex_model.sec...
Translating file io/multiplex/tests/multiplex_main.sec...
Translating file io/multiplex/tests/multiplex_scenario.sec...
Translating file io/streams/streams_media.sec...
Translating file io/streams/streams_model.sec...
Translating file io/streams/tests/streams_main.sec...
Translating file io/streams/tests/streams_scenario.sec...
Translating file io/syslog/syslog_media.sec...
Translating file io/syslog/syslog_model.sec...
Translating file io/syslog/tests/syslog_main.sec...
Translating file io/syslog/tests/syslog_scenario.sec...
Translating file memory/heap/heap_media.sec...
Translating file memory/heap/heap_model.sec...
Translating file memory/heap/tests/heap_main.sec...
Translating file memory/heap/tests/heap_scenario.sec...
Translating file memory/heap/tests/memory_scenario.sec...
Translating file memory/mman/mman_media.sec...
Translating file memory/mman/mman_model.sec...
Translating file memory/mman/tests/mman_b1_scenario.sec...
Translating file memory/mman/tests/mman_errors_scenario.sec...
Translating file memory/mman/tests/mman_main.sec...
Translating file memory/mman/tests/mman_scenario.sec...
Translating file memory/mman/tests/mman_usualuse_scenario.sec...
Translating file memory/break/break_media.sec...
Translating file memory/break/break_model.sec...
Translating file memory/break/tests/break_main.sec...
Translating file memory/break/tests/break_scenario.sec...
Translating file process/process/process_common.sec...
Translating file process/process/process_media.sec...
Translating file process/process/process_model.sec...
Translating file process/process/tests/process_main.sec...
Translating file process/process/tests/process_scenario.sec...
Translating file process/fenv/fenv_common.sec...
Translating file process/fenv/fenv_media.sec...
Translating file process/fenv/fenv_model.sec...
Translating file process/fenv/tests/fenv_main.sec...
Translating file process/fenv/tests/fenv_scenario.sec...
Translating file process/meta/fs_media.sec...
Translating file process/meta/fs_model.sec...
Translating file process/meta/meta_media.sec...
Translating file process/meta/meta_model.sec...
Translating file process/meta/nice_media.sec...
Translating file process/meta/nice_model.sec...
Translating file process/meta/user_media.sec...
Translating file process/meta/user_model.sec...
Translating file process/meta/tests/fs_scenario.sec...
Translating file process/meta/tests/meta_main.sec...
Translating file process/meta/tests/meta_scenario.sec...
Translating file process/meta/tests/nice_scenario.sec...
Translating file process/meta/tests/user_scenario.sec...
Translating file process/environ/environ_media.sec...
Translating file process/environ/environ_model.sec...
Translating file process/environ/tests/environ_main.sec...
Translating file process/environ/tests/environ_scenario.sec...
Translating file process/context/context_media.sec...
Translating file process/context/context_model.sec...
Translating file process/context/tests/context_main.sec...
Translating file process/context/tests/context_scenario.sec...
Translating file process/goto/goto_media.sec...
Translating file process/goto/goto_model.sec...
Translating file process/goto/tests/goto_main.sec...
Translating file process/goto/tests/goto_scenario.sec...
Translating file process/ipc/ipc_media.sec...
Translating file process/ipc/ipc_model.sec...
Translating file process/ipc/msg_media.sec...
Translating file process/ipc/msg_model.sec...
Translating file process/ipc/sem_media.sec...
Translating file process/ipc/sem_model.sec...
Translating file process/ipc/shm_media.sec...
Translating file process/ipc/shm_model.sec...
Translating file process/ipc/tests/ipc_main.sec...
Translating file process/ipc/tests/ipc_scenario.sec...
Translating file process/ipc/tests/msg_scenario.sec...
Translating file process/ipc/tests/sem_scenario.sec...
Translating file process/ipc/tests/shm_scenario.sec...
Translating file process/pgroup/pgroup_media.sec...
Translating file process/pgroup/pgroup_model.sec...
Translating file process/pgroup/tests/pgroup_main.sec...
Translating file process/pgroup/tests/pgroup_scenario.sec...
Translating file process/resources/resources_media.sec...
Translating file process/resources/resources_model.sec...
Translating file process/resources/tests/resources_main.sec...
Translating file process/resources/tests/resources_scenario.sec...
Translating file process/scheduler/scheduler_media.sec...
Translating file process/scheduler/scheduler_model.sec...
Translating file process/scheduler/tests/scheduler_main.sec...
Translating file process/scheduler/tests/scheduler_scenario.sec...
Translating file pthread/mutex/mutexattr_media.sec...
Translating file pthread/mutex/mutexattr_model.sec...
Translating file pthread/mutex/mutex_media.sec...
Translating file pthread/mutex/mutex_model.sec...
Translating file pthread/mutex/tests/mutexattr_scenario.sec...
Translating file pthread/mutex/tests/mutex_main.sec...
Translating file pthread/mutex/tests/mutex_mixed_scenario.sec...
Translating file pthread/mutex/tests/mutex_mixed_types_scenario.sec...
Translating file pthread/mutex/tests/mutex_scenario.sec...
Translating file pthread/mutex/tests/mutex_simple_scenario.sec...
Translating file pthread/mutex/tests/mutex_static_init_scenario.sec...
Translating file pthread/pthread/pthread_media.sec...
Translating file pthread/pthread/pthread_model.sec...
Translating file pthread/pthread/tests/pthread_cleanup_diff_scenario.sec...
Translating file pthread/pthread/tests/pthread_cleanup_simple_scenario.sec...
Translating file pthread/pthread/tests/pthread_create_cancel_scenario.sec...
Translating file pthread/pthread/tests/pthread_exit_join_scenario.sec...
Translating file pthread/pthread/tests/pthread_main.sec...
Translating file pthread/pthread/tests/pthread_scenario.sec...
Translating file pthread/attr/attr_media.sec...
Translating file pthread/attr/attr_model.sec...
Translating file pthread/attr/tests/attr_main.sec...
Translating file pthread/attr/tests/attr_scenario.sec...
Translating file pthread/rwlock/rwlockattr_media.sec...
Translating file pthread/rwlock/rwlockattr_model.sec...
Translating file pthread/rwlock/rwlock_media.sec...
Translating file pthread/rwlock/rwlock_model.sec...
Translating file pthread/rwlock/tests/rwlockattr_scenario.sec...
Translating file pthread/rwlock/tests/rwlock_deadlock_scenario.sec...
Translating file pthread/rwlock/tests/rwlock_errors_scenario.sec...
Translating file pthread/rwlock/tests/rwlock_init_destroy_scenario.sec...
Translating file pthread/rwlock/tests/rwlock_main.sec...
Translating file pthread/rwlock/tests/rwlock_N_rwlock_light_scenario.sec...
Translating file pthread/rwlock/tests/rwlock_N_rwlock_scenario.sec...
Translating file pthread/rwlock/tests/rwlock_repeated_lock_scenario.sec...
Translating file pthread/rwlock/tests/rwlock_scenario.sec...
Translating file pthread/rwlock/tests/rwlock_single_rwlock_scenario.sec...
Translating file pthread/scheduler/scheduler_media.sec...
Translating file pthread/scheduler/scheduler_model.sec...
Translating file pthread/scheduler/tests/scheduler_main.sec...
Translating file pthread/scheduler/tests/scheduler_scenario.sec...
Translating file pthread/cond/condattr_media.sec...
Translating file pthread/cond/condattr_model.sec...
Translating file pthread/cond/cond_media.sec...
Translating file pthread/cond/cond_model.sec...
Translating file pthread/cond/tests/condattr_scenario.sec...
Translating file pthread/cond/tests/cond_error_scenario.sec...
Translating file pthread/cond/tests/cond_init_destroy_scenario.sec...
Translating file pthread/cond/tests/cond_main.sec...
Translating file pthread/cond/tests/cond_scenario.sec...
Translating file pthread/cond/tests/cond_single_cond_scenario.sec...
Translating file pthread/sem/sem_media.sec...
Translating file pthread/sem/sem_model.sec...
Translating file pthread/sem/tests/sem_complex_scenario.sec...
Translating file pthread/sem/tests/sem_error_scenario.sec...
Translating file pthread/sem/tests/sem_main.sec...
Translating file pthread/sem/tests/sem_open_close_scenario.sec...
Translating file pthread/sem/tests/sem_scenario.sec...
Translating file pthread/tls/tls_media.sec...
Translating file pthread/tls/tls_model.sec...
Translating file pthread/tls/tests/tls_main.sec...
Translating file pthread/tls/tests/tls_scenario.sec...
Translating file system/system/system_model.sec...
Translating file system/sysconf/sysconf_media.sec...
Translating file system/sysconf/sysconf_model.sec...
Translating file system/sysconf/tests/sysconf_main.sec...
Translating file system/sysconf/tests/sysconf_scenario.sec...
Translating file system/user/account_media.sec...
Translating file system/user/account_model.sec...
Translating file system/user/group_media.sec...
Translating file system/user/group_model.sec...
Translating file system/user/user_media.sec...
Translating file system/user/user_model.sec...
Translating file system/user/tests/account_scenario.sec...
Translating file system/user/tests/group_scenario.sec...
Translating file system/user/tests/user_main.sec...
Translating file system/user/tests/user_scenario.sec...
Translating file system/host/host_media.sec...
Translating file system/host/host_model.sec...
Translating file system/host/tests/host_main.sec...
Translating file system/host/tests/host_scenario.sec...
Translating file system/stat/stat_media.sec...
Translating file system/stat/stat_model.sec...
Translating file system/stat/tests/stat_main.sec...
Translating file system/stat/tests/stat_scenario.sec...
Translating file util/assert/assert_media.sec...
Translating file util/assert/assert_model.sec...
Translating file util/assert/tests/assert_main.sec...
Translating file util/assert/tests/assert_scenario.sec...
Translating file util/bit/bit_media.sec...
Translating file util/bit/bit_model.sec...
Translating file util/bit/tests/bit_main.sec...
Translating file util/bit/tests/bit_scenario.sec...
Translating file util/compress/compress_media.sec...
Translating file util/compress/compress_model.sec...
Translating file util/compress/tests/compress_main.sec...
Translating file util/compress/tests/compress_scenario.sec...
Translating file util/conversion/strint_media.sec...
Translating file util/conversion/strint_model.sec...
Translating file util/conversion/strreal_media.sec...
Translating file util/conversion/strreal_model.sec...
Translating file util/conversion/token_media.sec...
Translating file util/conversion/token_model.sec...
Translating file util/conversion/util_conversion_common.sec...
Translating file util/conversion/wchar_media.sec...
Translating file util/conversion/wchar_model.sec...
Translating file util/conversion/wstrint_media.sec...
Translating file util/conversion/wstrint_model.sec...
Translating file util/conversion/wstrreal_media.sec...
Translating file util/conversion/wstrreal_model.sec...
Translating file util/conversion/wtoken_media.sec...
Translating file util/conversion/wtoken_model.sec...
Translating file util/conversion/tests/conversion_main.sec...
Translating file util/conversion/tests/strint_scenario.sec...
Translating file util/conversion/tests/strreal_scenario.sec...
Translating file util/conversion/tests/token_scenario.sec...
Translating file util/conversion/tests/wchar_scenario.sec...
Translating file util/conversion/tests/wstrint_scenario.sec...
Translating file util/conversion/tests/wstrreal_scenario.sec...
Translating file util/conversion/tests/wtoken_scenario.sec...
Translating file util/crypt/crypt_media.sec...
Translating file util/crypt/crypt_model.sec...
Translating file util/crypt/tests/crypt_main.sec...
Translating file util/crypt/tests/crypt_scenario.sec...
Translating file util/dl/dl_media.sec...
Translating file util/dl/dl_model.sec...
Translating file util/dl/tests/dl_main.sec...
Translating file util/dl/tests/dl_scenario.sec...
Translating file util/dl/tests/dl_syms.sec...
Translating file util/float/float_media.sec...
Translating file util/float/float_model.sec...
Translating file util/float/tests/float_main.sec...
Translating file util/float/tests/float_scenario.sec...
Translating file util/format/fmtmsg_media.sec...
Translating file util/format/fmtmsg_model.sec...
Translating file util/format/money_media.sec...
Translating file util/format/money_model.sec...
Translating file util/format/printf_media.sec...
Translating file util/format/printf_model.sec...
Translating file util/format/scanf_media.sec...
Translating file util/format/scanf_model.sec...
Translating file util/format/time_media.sec...
Translating file util/format/time_model.sec...
Translating file util/format/wprintf_media.sec...
Translating file util/format/wprintf_model.sec...
Translating file util/format/wscanf_media.sec...
Translating file util/format/wscanf_model.sec...
Translating file util/format/wtime_media.sec...
Translating file util/format/wtime_model.sec...
Translating file util/format/tests/fmtmsg_scenario.sec...
Translating file util/format/tests/format_main.sec...
Translating file util/format/tests/format_sheafs.sec...
Translating file util/format/tests/money_scenario.sec...
Translating file util/format/tests/printf_scenario_data.sec...
Translating file util/format/tests/printf_scenario.sec...
Translating file util/format/tests/scanf_scenario_data.sec...
Translating file util/format/tests/scanf_scenario.sec...
Translating file util/format/tests/time_scenario.sec...
Translating file util/format/tests/wprintf_scenario_data.sec...
Translating file util/format/tests/wprintf_scenario.sec...
Translating file util/format/tests/wscanf_scenario_data.sec...
Translating file util/format/tests/wscanf_scenario.sec...
Translating file util/format/tests/wtime_scenario.sec...
Translating file util/getopt/getopt_media.sec...
Translating file util/getopt/getopt_model.sec...
Translating file util/getopt/getopt.sec...
Translating file util/getopt/tests/getopt_main.sec...
Translating file util/getopt/tests/getopt_scenario.sec...
Translating file util/inet/inet_media.sec...
Translating file util/inet/inet_model.sec...
Translating file util/inet/tests/inet_main.sec...
Translating file util/inet/tests/inet_scenario.sec...
Translating file util/pam/pam_media.sec...
Translating file util/pam/pam_model.sec...
Translating file util/pam/tests/pam_main.sec...
Translating file util/pam/tests/pam_scenario.sec...
Translating file util/regex/regex_media.sec...
Translating file util/regex/regex_model.sec...
Translating file util/regex/tests/regex_main.sec...
Translating file util/regex/tests/regex_scenario.sec...
Translating file util/search/hash_media.sec...
Translating file util/search/hash_model.sec...
Translating file util/search/queue_media.sec...
Translating file util/search/queue_model.sec...
Translating file util/search/search_media.sec...
Translating file util/search/search_model.sec...
Translating file util/search/tree_media.sec...
Translating file util/search/tree_model.sec...
Translating file util/search/tests/hash_scenario.sec...
Translating file util/search/tests/queue_scenario.sec...
Translating file util/search/tests/search_main.sec...
Translating file util/search/tests/search_scenario.sec...
Translating file util/search/tests/tree_scenario.sec...
Translating file util/string/casecmp_media.sec...
Translating file util/string/casecmp_model.sec...
Translating file util/string/mem_media.sec...
Translating file util/string/mem_model.sec...
Translating file util/string/str_media.sec...
Translating file util/string/str_model.sec...
Translating file util/string/wcasecmp_media.sec...
Translating file util/string/wcasecmp_model.sec...
Translating file util/string/wmem_media.sec...
Translating file util/string/wmem_model.sec...
Translating file util/string/wstr_media.sec...
Translating file util/string/wstr_model.sec...
Translating file util/string/tests/casecmp_scenario.sec...
Translating file util/string/tests/mem_scenario.sec...
Translating file util/string/tests/string_main.sec...
Translating file util/string/tests/str_scenario.sec...
Translating file util/string/tests/wcasecmp_scenario.sec...
Translating file util/string/tests/wmem_scenario.sec...
Translating file util/string/tests/wstr_scenario.sec...
Translating file util/wordexp/wordexp_media.sec...
Translating file util/wordexp/wordexp_model.sec...
Translating file util/wordexp/tests/wordexp_main.sec...
Translating file util/wordexp/tests/wordexp_scenario.sec...
Translating file math/bessel/bessel_media.sec...
Translating file math/bessel/bessel_model.sec...
Translating file math/bessel/tests/bessel_main.sec...
Translating file math/bessel/tests/bessel_scenario.sec...
Translating file math/cexp/cexp_media.sec...
Translating file math/cexp/cexp_model.sec...
Translating file math/cexp/tests/cexp_main.sec...
Translating file math/cexp/tests/cexp_scenario.sec...
Translating file math/chyper/chyper_media.sec...
Translating file math/chyper/chyper_model.sec...
Translating file math/chyper/tests/chyper_main.sec...
Translating file math/chyper/tests/chyper_scenario.sec...
Translating file math/complex/complex_media.sec...
Translating file math/complex/complex_model.sec...
Translating file math/complex/tests/complex_main.sec...
Translating file math/complex/tests/complex_scenario.sec...
Translating file math/ctrig/ctrig_media.sec...
Translating file math/ctrig/ctrig_model.sec...
Translating file math/ctrig/tests/ctrig_main.sec...
Translating file math/ctrig/tests/ctrig_scenario.sec...
Translating file math/error/error_media.sec...
Translating file math/error/error_model.sec...
Translating file math/error/tests/error_main.sec...
Translating file math/error/tests/error_scenario.sec...
Translating file math/exp/exp_media.sec...
Translating file math/exp/exp_model.sec...
Translating file math/exp/tests/exp_main.sec...
Translating file math/exp/tests/exp_scenario.sec...
Translating file math/gamma/gamma_media.sec...
Translating file math/gamma/gamma_model.sec...
Translating file math/gamma/tests/gamma_main.sec...
Translating file math/gamma/tests/gamma_scenario.sec...
Translating file math/hyper/hyper_media.sec...
Translating file math/hyper/hyper_model.sec...
Translating file math/hyper/tests/hyper_main.sec...
Translating file math/hyper/tests/hyper_scenario.sec...
Translating file math/integer/integer_media.sec...
Translating file math/integer/integer_model.sec...
Translating file math/integer/tests/integer_main.sec...
Translating file math/integer/tests/integer_scenario.sec...
Translating file math/math/math_data.sec...
Translating file math/rand/rand_media.sec...
Translating file math/rand/rand_model.sec...
Translating file math/rand/tests/rand_main.sec...
Translating file math/rand/tests/rand_scenario.sec...
Translating file math/real/real_media.sec...
Translating file math/real/real_model.sec...
Translating file math/real/tests/real_main.sec...
Translating file math/real/tests/real_scenario.sec...
Translating file math/trig/trig_media.sec...
Translating file math/trig/trig_model.sec...
Translating file math/trig/tests/trig_main.sec...
Translating file math/trig/tests/trig_scenario.sec...
Translating file locale/collate/collate_media.sec...
Translating file locale/collate/collate_model.sec...
Translating file locale/collate/tests/collate_main.sec...
Translating file locale/collate/tests/collate_scenario.sec...
Translating file locale/ctrans/ctrans_media.sec...
Translating file locale/ctrans/ctrans_model.sec...
Translating file locale/ctrans/tests/ctrans_main.sec...
Translating file locale/ctrans/tests/ctrans_scenario.sec...
Translating file locale/ctype/ctype_media.sec...
Translating file locale/ctype/ctype_model.sec...
Translating file locale/ctype/tests/ctype_main.sec...
Translating file locale/ctype/tests/ctype_scenario.sec...
Translating file locale/iconv/iconv_media.sec...
Translating file locale/iconv/iconv_model.sec...
Translating file locale/iconv/tests/iconv_main.sec...
Translating file locale/iconv/tests/iconv_scenario.sec...
Translating file locale/locale/locale_media.sec...
Translating file locale/locale/locale_model.sec...
Translating file locale/locale/tests/locale_main.sec...
Translating file locale/locale/tests/locale_scenario.sec...
Translating file locale/messages/messages_media.sec...
Translating file locale/messages/messages_model.sec...
Translating file locale/messages/tests/messages_main.sec...
Translating file locale/messages/tests/messages_scenario.sec...
Translating file locale/nlcat/nlcat_media.sec...
Translating file locale/nlcat/nlcat_model.sec...
Translating file locale/nlcat/tests/nlcat_main.sec...
Translating file locale/nlcat/tests/nlcat_scenario.sec...
Translating file locale/textdomain/textdomain_media.sec...
Translating file locale/textdomain/textdomain_model.sec...
Translating file locale/textdomain/tests/textdomain_main.sec...
Translating file locale/textdomain/tests/textdomain_scenario.sec...
Translating file locale/wcollate/wcollate_media.sec...
Translating file locale/wcollate/wcollate_model.sec...
Translating file locale/wcollate/tests/wcollate_main.sec...
Translating file locale/wcollate/tests/wcollate_scenario.sec...
Translating file locale/wctrans/wctrans_media.sec...
Translating file locale/wctrans/wctrans_model.sec...
Translating file locale/wctrans/tests/wctrans_main.sec...
Translating file locale/wctrans/tests/wctrans_scenario.sec...
Translating file locale/wctype/wctype_media.sec...
Translating file locale/wctype/wctype_model.sec...
Translating file locale/wctype/tests/wctype_main.sec...
Translating file locale/wctype/tests/wctype_scenario.sec...
Translating file signal/sigaction/sigaction_media.sec...
Translating file signal/sigaction/sigaction_model.sec...
Translating file signal/sigaction/tests/sigaction_main.sec...
Translating file signal/sigaction/tests/sigaction_scenario.sec...
Translating file signal/sigctrl/sigctrl_media.sec...
Translating file signal/sigctrl/sigctrl_model.sec...
Translating file signal/sigctrl/tests/sigctrl_main.sec...
Translating file signal/sigctrl/tests/sigctrl_scenario.sec...
Translating file signal/sigsend/sigsend_media.sec...
Translating file signal/sigsend/sigsend_model.sec...
Translating file signal/sigsend/tests/signal_specific_scenario.sec...
Translating file signal/sigsend/tests/sigsend_additional_scenario.sec...
Translating file signal/sigsend/tests/sigsend_main.sec...
Translating file signal/sigsend/tests/sigsend_scenario.sec...
Translating file signal/sigset/sigset_media.sec...
Translating file signal/sigset/sigset_model.sec...
Translating file signal/sigset/tests/sigset_automatic_scenario.sec...
Translating file signal/sigset/tests/sigset_main.sec...
Translating file signal/sigset/tests/sigset_scenario.sec...
Translating file signal/sigset/tests/sigset_static_scenario.sec...
Translating file signal/sigstr/sigstr_media.sec...
Translating file signal/sigstr/sigstr_model.sec...
Translating file signal/sigstr/tests/sigstr_main.sec...
Translating file signal/sigstr/tests/sigstr_scenario.sec...
Translating file signal/sigwait/sigwait_media.sec...
Translating file signal/sigwait/sigwait_model.sec...
Translating file signal/sigwait/tests/sigwait_main.sec...
Translating file signal/sigwait/tests/sigwait_scenario.sec...
Translating file socket/netdata/netdata_media.sec...
Translating file socket/netdata/netdata_model.sec...
Translating file socket/netdata/tests/netdata_main.sec...
Translating file socket/netdata/tests/netdata_scenario.sec...
Translating file socket/netdb/netdb_media.sec...
Translating file socket/netdb/netdb_model.sec...
Translating file socket/netdb/tests/netdb_main.sec...
Translating file socket/netdb/tests/netdb_scenario.sec...
Translating file socket/netif/netif_media.sec...
Translating file socket/netif/netif_model.sec...
Translating file socket/netif/tests/netif_main.sec...
Translating file socket/netif/tests/netif_scenario.sec...
Translating file socket/rpc/clnt_media.sec...
Translating file socket/rpc/clnt_model.sec...
Translating file socket/rpc/pmap_media.sec...
Translating file socket/rpc/pmap_model.sec...
Translating file socket/rpc/secure_media.sec...
Translating file socket/rpc/secure_model.sec...
Translating file socket/rpc/svc_media.sec...
Translating file socket/rpc/svc_model.sec...
Translating file socket/rpc/xdr_media.sec...
Translating file socket/rpc/xdr_model.sec...
Translating file socket/rpc/tests/pmap_scenario.sec...
Translating file socket/rpc/tests/rpc_main.sec...
Translating file socket/rpc/tests/secure_scenario.sec...
Translating file socket/rpc/tests/svc_clnt_scenario.sec...
Translating file socket/rpc/tests/xdr_scenario.sec...
Translating file socket/socket/socket_media.sec...
Translating file socket/socket/socket_model.sec...
Translating file socket/socket/tests/socket_main.sec...
Translating file socket/socket/tests/socket_scenario.sec...
Translating file time/clock/clock_media.sec...
Translating file time/clock/clock_model.sec...
Translating file time/clock/tests/clock_main.sec...
Translating file time/clock/tests/clock_scenario.sec...
Translating file time/conversion/conversion_media.sec...
Translating file time/conversion/conversion_model.sec...
Translating file time/conversion/tests/conversion_main.sec...
Translating file time/conversion/tests/conversion_scenario.sec...
Translating file time/time/time_media.sec...
Translating file time/time/time_model.sec...
Translating file time/time/tests/time_main.sec...
Translating file time/time/tests/time_scenario.sec...
Translating file time/timer/timer_media.sec...
Translating file time/timer/timer_model.sec...
Translating file time/timer/tests/timer_main.sec...
Translating file time/timer/tests/timer_scenario.sec...
Translating file ncurses/bkgd/bkgd_media.sec...
Translating file ncurses/bkgd/bkgd_model.sec...
Translating file ncurses/bkgd/tests/bkgd_main.sec...
Translating file ncurses/bkgd/tests/bkgd_scenario.sec...
Translating file ncurses/border/border_media.sec...
Translating file ncurses/border/border_model.sec...
Translating file ncurses/border/tests/border_main.sec...
Translating file ncurses/border/tests/border_scenario.sec...
Translating file ncurses/char/add_media.sec...
Translating file ncurses/char/add_model.sec...
Translating file ncurses/char/input_media.sec...
Translating file ncurses/char/input_model.sec...
Translating file ncurses/char/insert_media.sec...
Translating file ncurses/char/insert_model.sec...
Translating file ncurses/char/tests/add_scenario.sec...
Translating file ncurses/char/tests/char_main.sec...
Translating file ncurses/char/tests/input_scenario.sec...
Translating file ncurses/char/tests/insert_scenario.sec...
Translating file ncurses/chgat/chgat_media.sec...
Translating file ncurses/chgat/chgat_model.sec...
Translating file ncurses/chgat/tests/chgat_main.sec...
Translating file ncurses/chgat/tests/chgat_scenario.sec...
Translating file ncurses/chstr/add_media.sec...
Translating file ncurses/chstr/add_model.sec...
Translating file ncurses/chstr/input_media.sec...
Translating file ncurses/chstr/input_model.sec...
Translating file ncurses/chstr/tests/add_scenario.sec...
Translating file ncurses/chstr/tests/chstr_main.sec...
Translating file ncurses/chstr/tests/input_scenario.sec...
Translating file ncurses/clear/clear_media.sec...
Translating file ncurses/clear/clear_model.sec...
Translating file ncurses/clear/tests/clear_main.sec...
Translating file ncurses/clear/tests/clear_scenario.sec...
Translating file ncurses/color/color_media.sec...
Translating file ncurses/color/color_model.sec...
Translating file ncurses/color/tests/color_main.sec...
Translating file ncurses/color/tests/color_scenario.sec...
Translating file ncurses/input/char_media.sec...
Translating file ncurses/input/char_model.sec...
Translating file ncurses/input/input_media.sec...
Translating file ncurses/input/input_model.sec...
Translating file ncurses/input/string_media.sec...
Translating file ncurses/input/string_model.sec...
Translating file ncurses/input/timeout_media.sec...
Translating file ncurses/input/timeout_model.sec...
Translating file ncurses/input/tests/char_scenario.sec...
Translating file ncurses/input/tests/input_main.sec...
Translating file ncurses/input/tests/input_scenario.sec...
Translating file ncurses/input/tests/string_scenario.sec...
Translating file ncurses/input/tests/timeout_scenario.sec...
Translating file ncurses/line/line_media.sec...
Translating file ncurses/line/line_model.sec...
Translating file ncurses/line/tests/line_main.sec...
Translating file ncurses/line/tests/line_scenario.sec...
Translating file ncurses/misc/misc_media.sec...
Translating file ncurses/misc/misc_model.sec...
Translating file ncurses/misc/tests/misc_main.sec...
Translating file ncurses/misc/tests/misc_scenario.sec...
Translating file ncurses/mode/mode_media.sec...
Translating file ncurses/mode/mode_model.sec...
Translating file ncurses/mode/tests/mode_main.sec...
Translating file ncurses/mode/tests/mode_scenario.sec...
Translating file ncurses/move/move_media.sec...
Translating file ncurses/move/move_model.sec...
Translating file ncurses/move/tests/move_main.sec...
Translating file ncurses/move/tests/move_scenario.sec...
Translating file ncurses/screen/screen_media.sec...
Translating file ncurses/screen/screen_model.sec...
Translating file ncurses/screen/tests/screen_main.sec...
Translating file ncurses/screen/tests/screen_scenario.sec...
Translating file ncurses/slk/slk_media.sec...
Translating file ncurses/slk/slk_model.sec...
Translating file ncurses/slk/tests/slk_main.sec...
Translating file ncurses/slk/tests/slk_scenario.sec...
Translating file ncurses/string/add_media.sec...
Translating file ncurses/string/add_model.sec...
Translating file ncurses/string/input_media.sec...
Translating file ncurses/string/input_model.sec...
Translating file ncurses/string/insert_media.sec...
Translating file ncurses/string/insert_model.sec...
Translating file ncurses/string/printf_media.sec...
Translating file ncurses/string/printf_model.sec...
Translating file ncurses/string/scanf_media.sec...
Translating file ncurses/string/scanf_model.sec...
Translating file ncurses/string/tests/add_scenario.sec...
Translating file ncurses/string/tests/input_scenario.sec...
Translating file ncurses/string/tests/insert_scenario.sec...
Translating file ncurses/string/tests/printf_scenario.sec...
Translating file ncurses/string/tests/scanf_scenario.sec...
Translating file ncurses/string/tests/string_main.sec...
Translating file ncurses/terminal/control_media.sec...
Translating file ncurses/terminal/control_model.sec...
Translating file ncurses/terminal/termcap_media.sec...
Translating file ncurses/terminal/termcap_model.sec...
Translating file ncurses/terminal/terminal_media.sec...
Translating file ncurses/terminal/terminal_model.sec...
Translating file ncurses/terminal/terminfo_media.sec...
Translating file ncurses/terminal/terminfo_model.sec...
Translating file ncurses/terminal/tests/control_main.sec...
Translating file ncurses/terminal/tests/control_scenario.sec...
Translating file ncurses/terminal/tests/termcap_main.sec...
Translating file ncurses/terminal/tests/termcap_scenario.sec...
Translating file ncurses/terminal/tests/terminal_main.sec...
Translating file ncurses/terminal/tests/terminal_scenario.sec...
Translating file ncurses/terminal/tests/terminfo_scenario.sec...
Translating file ncurses/window/attr_media.sec...
Translating file ncurses/window/attr_model.sec...
Translating file ncurses/window/pad_media.sec...
Translating file ncurses/window/pad_model.sec...
Translating file ncurses/window/refresh_media.sec...
Translating file ncurses/window/refresh_model.sec...
Translating file ncurses/window/scroll_media.sec...
Translating file ncurses/window/scroll_model.sec...
Translating file ncurses/window/window_media.sec...
Translating file ncurses/window/window_model.sec...
Translating file ncurses/window/tests/attr_scenario.sec...
Translating file ncurses/window/tests/pad_scenario.sec...
Translating file ncurses/window/tests/refresh_scenario.sec...
Translating file ncurses/window/tests/scroll_main.sec...
Translating file ncurses/window/tests/scroll_scenario.sec...
Translating file ncurses/window/tests/window_main.sec...
Translating file ncurses/window/tests/window_scenario.sec...
Translating file ncurses/ncurses/chtypearray.sec...
Translating file ncurses/ncurses/ncurses_data.sec...
Translating file ncurses/ncurses/special_chars_scenario.sec...
Massive CTESK processor launched ... Thu Oct 30 08:17:08 UTC 2008
libnuma: Warning: /sys not mounted or no numa system. Assuming one node: No such file or directory
sec 2.7.261-beta-080905
-  sec.properties
+  sec.plugins

<- common/cbytearray.sei
generate:
-> common/cbytearray.c
0 error(s), 0 warning(s)
sec 2.7.261-beta-080905
-  sec.properties
+  sec.plugins

<- common/common_media.sei
generate:
-> common/common_media.c
0 error(s), 0 warning(s)
sec 2.7.261-beta-080905
-  sec.properties
+  sec.plugins

<- common/common_model.sei
generate:
common/common_model.sec(336,5): warning: implicit declaration of function '__builtin_va_start'.
common/common_model.sec(341,5): warning: implicit declaration of function '__builtin_va_end'.
-> common/common_model.c
0 error(s), 2 warning(s)
sec 2.7.261-beta-080905
-  sec.properties
+  sec.plugins

<- common/common_scenario.sei
generate:
-> common/common_scenario.c
0 error(s), 0 warning(s)
sec 2.7.261-beta-080905
-  sec.properties
+  sec.plugins

<- common/control_center.sei
generate:
-> common/control_center.c
0 error(s), 0 warning(s)
sec 2.7.261-beta-080905
-  sec.properties
+  sec.plugins

<- common/coverages.sei
generate:
-> common/coverages.c
0 error(s), 0 warning(s)
sec 2.7.261-beta-080905
-  sec.properties
+  sec.plugins

<- common/cstring.sei
generate:
-> common/cstring.c
0 error(s), 0 warning(s)
sec 2.7.261-beta-080905
-  sec.properties
+  sec.plugins

<- common/init.sei
generate:
-> common/init.c
0 error(s), 0 warning(s)
sec 2.7.261-beta-080905
-  sec.properties
+  sec.plugins

<- common/main.sei
generate:
-> common/main.c
0 error(s), 0 warning(s)
sec 2.7.261-beta-080905
-  sec.properties
+  sec.plugins

<- common/pointer.sei
generate:
-> common/pointer.c
0 error(s), 0 warning(s)
sec 2.7.261-beta-080905
-  sec.properties
+  sec.plugins

<- common/tree.sei
generate:
-> common/tree.c
0 error(s), 0 warning(s)
sec 2.7.261-beta-080905
-  sec.properties
+  sec.plugins

<- common/tsstream.sei
generate:
-> common/tsstream.c
0 error(s), 0 warning(s)
sec 2.7.261-beta-080905
-  sec.properties
+  sec.plugins

<- common/wchararray.sei
generate:
-> common/wchararray.c
0 error(s), 0 warning(s)
sec 2.7.261-beta-080905
-  sec.properties
+  sec.plugins

<- common/wstring.sei
generate:
-> common/wstring.c
0 error(s), 0 warning(s)
sec 2.7.261-beta-080905
-  sec.properties
+  sec.plugins

<- config/config_loader.sei
generate:
-> config/config_loader.c
0 error(s), 0 warning(s)
sec 2.7.261-beta-080905
-  sec.properties
+  sec.plugins

<- config/interpretation.sei
generate:
-> config/interpretation.c
0 error(s), 0 warning(s)
sec 2.7.261-beta-080905
-  sec.properties
+  sec.plugins

<- config/pthread_config.sei
generate:
-> config/pthread_config.c
0 error(s), 0 warning(s)
sec 2.7.261-beta-080905
-  sec.properties
+  sec.plugins

<- config/system_config.sei
generate:
-> config/system_config.c
0 error(s), 0 warning(s)
sec 2.7.261-beta-080905
-  sec.properties
+  sec.plugins

<- config/type_config.sei
generate:
-> config/type_config.c
0 error(s), 0 warning(s)
sec 2.7.261-beta-080905
-  sec.properties
+  sec.plugins

<- core/core.sei
generate:
-> core/core.c
0 error(s), 0 warning(s)
sec 2.7.261-beta-080905
-  sec.properties
+  sec.plugins

<- data/basis.sei
generate:
-> data/basis.c
0 error(s), 0 warning(s)
sec 2.7.261-beta-080905
-  sec.properties
+  sec.plugins

<- data/embed_model.sei
generate:
-> data/embed_model.c
0 error(s), 0 warning(s)
sec 2.7.261-beta-080905
-  sec.properties
+  sec.plugins

<- data/locale_model.sei
generate:
-> data/locale_model.c
0 error(s), 0 warning(s)
sec 2.7.261-beta-080905
-  sec.properties
+  sec.plugins

<- data/signal_model.sei
generate:
-> data/signal_model.c
0 error(s), 0 warning(s)
sec 2.7.261-beta-080905
-  sec.properties
+  sec.plugins

<- data/time_model.sei
generate:
-> data/time_model.c
0 error(s), 0 warning(s)
sec 2.7.261-beta-080905
-  sec.properties
+  sec.plugins

<- data/wchar_model.sei
generate:
-> data/wchar_model.c
0 error(s), 0 warning(s)
sec 2.7.261-beta-080905
-  sec.properties
+  sec.plugins

<- data/sys/timeb_model.sei
generate:
-> data/sys/timeb_model.c
0 error(s), 0 warning(s)
sec 2.7.261-beta-080905
-  sec.properties
+  sec.plugins

<- data/sys/time_model.sei
generate:
-> data/sys/time_model.c
0 error(s), 0 warning(s)
sec 2.7.261-beta-080905
-  sec.properties
+  sec.plugins

<- fs/dir/dir_media.sei
generate:
-> fs/dir/dir_media.c
0 error(s), 0 warning(s)
sec 2.7.261-beta-080905
-  sec.properties
+  sec.plugins

<- fs/dir/dir_model.sei
generate:
-> fs/dir/dir_model.c
0 error(s), 0 warning(s)
sec 2.7.261-beta-080905
-  sec.properties
+  sec.plugins

<- fs/dir/tests/dir_main.sei
generate:
-> fs/dir/tests/dir_main.c
0 error(s), 0 warning(s)
sec 2.7.261-beta-080905
-  sec.properties
+  sec.plugins

<- fs/dir/tests/dir_scenario.sei
generate:
-> fs/dir/tests/dir_scenario.c
0 error(s), 0 warning(s)
sec 2.7.261-beta-080905
-  sec.properties
+  sec.plugins

<- fs/dir/tests/fs_dump.sei
generate:
-> fs/dir/tests/fs_dump.c
0 error(s), 0 warning(s)
sec 2.7.261-beta-080905
-  sec.properties
+  sec.plugins

<- fs/fifo/fifo_media.sei
generate:
-> fs/fifo/fifo_media.c
0 error(s), 0 warning(s)
sec 2.7.261-beta-080905
-  sec.properties
+  sec.plugins

<- fs/fifo/fifo_model.sei
generate:
-> fs/fifo/fifo_model.c
0 error(s), 0 warning(s)
sec 2.7.261-beta-080905
-  sec.properties
+  sec.plugins

<- fs/fifo/tests/fifo_main.sei
generate:
-> fs/fifo/tests/fifo_main.c
0 error(s), 0 warning(s)
sec 2.7.261-beta-080905
-  sec.properties
+  sec.plugins

<- fs/fifo/tests/fifo_scenario.sei
generate:
-> fs/fifo/tests/fifo_scenario.c
0 error(s), 0 warning(s)
sec 2.7.261-beta-080905
-  sec.properties
+  sec.plugins

<- fs/fs/fs_media.sei
generate:
-> fs/fs/fs_media.c
0 error(s), 0 warning(s)
sec 2.7.261-beta-080905
-  sec.properties
+  sec.plugins

<- fs/fs/fs_model.sei
generate:
-> fs/fs/fs_model.c
0 error(s), 0 warning(s)
sec 2.7.261-beta-080905
-  sec.properties
+  sec.plugins

<- fs/fs/tests/fs_main.sei
generate:
-> fs/fs/tests/fs_main.c
0 error(s), 0 warning(s)
sec 2.7.261-beta-080905
-  sec.properties
+  sec.plugins

<- fs/fs/tests/fs_scenario.sei
generate:
-> fs/fs/tests/fs_scenario.c
0 error(s), 0 warning(s)
sec 2.7.261-beta-080905
-  sec.properties
+  sec.plugins

<- fs/ftw/ftw_media.sei
generate:
-> fs/ftw/ftw_media.c
0 error(s), 0 warning(s)
sec 2.7.261-beta-080905
-  sec.properties
+  sec.plugins

<- fs/ftw/ftw_model.sei
generate:
-> fs/ftw/ftw_model.c
0 error(s), 0 warning(s)
sec 2.7.261-beta-080905
-  sec.properties
+  sec.plugins

<- fs/ftw/tests/ftw_main.sei
generate:
-> fs/ftw/tests/ftw_main.c
0 error(s), 0 warning(s)
sec 2.7.261-beta-080905
-  sec.properties
+  sec.plugins

<- fs/ftw/tests/ftw_scenario.sei
generate:
-> fs/ftw/tests/ftw_scenario.c
0 error(s), 0 warning(s)
sec 2.7.261-beta-080905
-  sec.properties
+  sec.plugins

<- fs/glob/glob_media.sei
generate:
-> fs/glob/glob_media.c
0 error(s), 0 warning(s)
sec 2.7.261-beta-080905
-  sec.properties
+  sec.plugins

<- fs/glob/glob_model.sei
generate:
-> fs/glob/glob_model.c
0 error(s), 0 warning(s)
sec 2.7.261-beta-080905
-  sec.properties
+  sec.plugins

<- fs/glob/tests/glob_main.sei
generate:
-> fs/glob/tests/glob_main.c
0 error(s), 0 warning(s)
sec 2.7.261-beta-080905
-  sec.properties
+  sec.plugins

<- fs/glob/tests/glob_scenario.sei
generate:
-> fs/glob/tests/glob_scenario.c
0 error(s), 0 warning(s)
sec 2.7.261-beta-080905
-  sec.properties
+  sec.plugins

<- fs/meta/access_media.sei
generate:
-> fs/meta/access_media.c
0 error(s), 0 warning(s)
sec 2.7.261-beta-080905
-  sec.properties
+  sec.plugins

<- fs/meta/access_model.sei
generate:
-> fs/meta/access_model.c
0 error(s), 0 warning(s)
sec 2.7.261-beta-080905
-  sec.properties
+  sec.plugins

<- fs/meta/meta_media.sei
generate:
-> fs/meta/meta_media.c
0 error(s), 0 warning(s)
sec 2.7.261-beta-080905
-  sec.properties
+  sec.plugins

<- fs/meta/meta_model.sei
generate:
-> fs/meta/meta_model.c
0 error(s), 0 warning(s)
sec 2.7.261-beta-080905
-  sec.properties
+  sec.plugins

<- fs/meta/statvfs_media.sei
generate:
-> fs/meta/statvfs_media.c
0 error(s), 0 warning(s)
sec 2.7.261-beta-080905
-  sec.properties
+  sec.plugins

<- fs/meta/statvfs_model.sei
generate:
-> fs/meta/statvfs_model.c
0 error(s), 0 warning(s)
sec 2.7.261-beta-080905
-  sec.properties
+  sec.plugins

<- fs/meta/tests/access_scenario.sei
generate:
-> fs/meta/tests/access_scenario.c
0 error(s), 0 warning(s)
sec 2.7.261-beta-080905
-  sec.properties
+  sec.plugins

<- fs/meta/tests/fs_meta_common_scenario.sei
generate:
-> fs/meta/tests/fs_meta_common_scenario.c
0 error(s), 0 warning(s)
sec 2.7.261-beta-080905
-  sec.properties
+  sec.plugins

<- fs/meta/tests/meta_main.sei
generate:
-> fs/meta/tests/meta_main.c
0 error(s), 0 warning(s)
sec 2.7.261-beta-080905
-  sec.properties
+  sec.plugins

<- fs/meta/tests/meta_scenario.sei
generate:
-> fs/meta/tests/meta_scenario.c
0 error(s), 0 warning(s)
sec 2.7.261-beta-080905
-  sec.properties
+  sec.plugins

<- fs/meta/tests/statvfs_scenario.sei
generate:
-> fs/meta/tests/statvfs_scenario.c
0 error(s), 0 warning(s)
sec 2.7.261-beta-080905
-  sec.properties
+  sec.plugins

<- fs/name/name_media.sei
generate:
-> fs/name/name_media.c
0 error(s), 0 warning(s)
sec 2.7.261-beta-080905
-  sec.properties
+  sec.plugins

<- fs/name/name_model.sei
generate:
-> fs/name/name_model.c
0 error(s), 0 warning(s)
sec 2.7.261-beta-080905
-  sec.properties
+  sec.plugins

<- fs/name/tests/name_main.sei
generate:
-> fs/name/tests/name_main.c
0 error(s), 0 warning(s)
sec 2.7.261-beta-080905
-  sec.properties
+  sec.plugins

<- fs/name/tests/name_scenario.sei
generate:
-> fs/name/tests/name_scenario.c
0 error(s), 0 warning(s)
sec 2.7.261-beta-080905
-  sec.properties
+  sec.plugins

<- fs/symlink/symlink_media.sei
generate:
-> fs/symlink/symlink_media.c
0 error(s), 0 warning(s)
sec 2.7.261-beta-080905
-  sec.properties
+  sec.plugins

<- fs/symlink/symlink_model.sei
generate:
-> fs/symlink/symlink_model.c
0 error(s), 0 warning(s)
sec 2.7.261-beta-080905
-  sec.properties
+  sec.plugins

<- fs/symlink/tests/symlink_main.sei
generate:
-> fs/symlink/tests/symlink_main.c
0 error(s), 0 warning(s)
sec 2.7.261-beta-080905
-  sec.properties
+  sec.plugins

<- fs/symlink/tests/symlink_scenario.sei
generate:
-> fs/symlink/tests/symlink_scenario.c
0 error(s), 0 warning(s)
sec 2.7.261-beta-080905
-  sec.properties
+  sec.plugins

<- fs/tmpfile/tmpfile_media.sei
generate:
-> fs/tmpfile/tmpfile_media.c
0 error(s), 0 warning(s)
sec 2.7.261-beta-080905
-  sec.properties
+  sec.plugins

<- fs/tmpfile/tmpfile_model.sei
generate:
-> fs/tmpfile/tmpfile_model.c
0 error(s), 0 warning(s)
sec 2.7.261-beta-080905
-  sec.properties
+  sec.plugins

<- fs/tmpfile/tests/tmpfile_main.sei
generate:
-> fs/tmpfile/tests/tmpfile_main.c
0 error(s), 0 warning(s)
sec 2.7.261-beta-080905
-  sec.properties
+  sec.plugins

<- fs/tmpfile/tests/tmpfile_scenario.sei
generate:
-> fs/tmpfile/tests/tmpfile_scenario.c
0 error(s), 0 warning(s)
sec 2.7.261-beta-080905
-  sec.properties
+  sec.plugins

<- io/file/file_media.sei
generate:
-> io/file/file_media.c
0 error(s), 0 warning(s)
sec 2.7.261-beta-080905
-  sec.properties
+  sec.plugins

<- io/file/file_model.sei
generate:
-> io/file/file_model.c
0 error(s), 0 warning(s)
sec 2.7.261-beta-080905
-  sec.properties
+  sec.plugins

<- io/file/tests/file_lock_scenario.sei
generate:
-> io/file/tests/file_lock_scenario.c
0 error(s), 0 warning(s)
sec 2.7.261-beta-080905
-  sec.properties
+  sec.plugins

<- io/file/tests/file_main.sei
generate:
-> io/file/tests/file_main.c
0 error(s), 0 warning(s)
sec 2.7.261-beta-080905
-  sec.properties
+  sec.plugins

<- io/file/tests/file_scenario.sei
generate:
-> io/file/tests/file_scenario.c
0 error(s), 0 warning(s)
sec 2.7.261-beta-080905
-  sec.properties
+  sec.plugins

<- io/term/term_media.sei
generate:
-> io/term/term_media.c
0 error(s), 0 warning(s)
sec 2.7.261-beta-080905
-  sec.properties
+  sec.plugins

<- io/term/term_model.sei
generate:
-> io/term/term_model.c
0 error(s), 0 warning(s)
sec 2.7.261-beta-080905
-  sec.properties
+  sec.plugins

<- io/term/tests/cf_scenario.sei
generate:
-> io/term/tests/cf_scenario.c
0 error(s), 0 warning(s)
sec 2.7.261-beta-080905
-  sec.properties
+  sec.plugins

<- io/term/tests/cterm_scenario.sei
generate:
-> io/term/tests/cterm_scenario.c
0 error(s), 0 warning(s)
sec 2.7.261-beta-080905
-  sec.properties
+  sec.plugins

<- io/term/tests/open_tty_scenario.sei
generate:
-> io/term/tests/open_tty_scenario.c
0 error(s), 0 warning(s)
sec 2.7.261-beta-080905
-  sec.properties
+  sec.plugins

<- io/term/tests/pt_scenario.sei
generate:
-> io/term/tests/pt_scenario.c
0 error(s), 0 warning(s)
sec 2.7.261-beta-080905
-  sec.properties
+  sec.plugins

<- io/term/tests/rw_canon_scenario.sei
generate:
-> io/term/tests/rw_canon_scenario.c
0 error(s), 0 warning(s)
sec 2.7.261-beta-080905
-  sec.properties
+  sec.plugins

<- io/term/tests/rw_case_a_scenario.sei
generate:
-> io/term/tests/rw_case_a_scenario.c
0 error(s), 0 warning(s)
sec 2.7.261-beta-080905
-  sec.properties
+  sec.plugins

<- io/term/tests/rw_case_b_scenario.sei
generate:
-> io/term/tests/rw_case_b_scenario.c
0 error(s), 0 warning(s)
sec 2.7.261-beta-080905
-  sec.properties
+  sec.plugins

<- io/term/tests/rw_case_c_scenario.sei
generate:
-> io/term/tests/rw_case_c_scenario.c
0 error(s), 0 warning(s)
sec 2.7.261-beta-080905
-  sec.properties
+  sec.plugins

<- io/term/tests/rw_case_d_scenario.sei
generate:
-> io/term/tests/rw_case_d_scenario.c
0 error(s), 0 warning(s)
sec 2.7.261-beta-080905
-  sec.properties
+  sec.plugins

<- io/term/tests/tcpgrp_scenario.sei
generate:
-> io/term/tests/tcpgrp_scenario.c
0 error(s), 0 warning(s)
sec 2.7.261-beta-080905
-  sec.properties
+  sec.plugins

<- io/term/tests/tc_scenario.sei
generate:
-> io/term/tests/tc_scenario.c
0 error(s), 0 warning(s)
sec 2.7.261-beta-080905
-  sec.properties
+  sec.plugins

<- io/term/tests/term_main.sei
generate:
-> io/term/tests/term_main.c
0 error(s), 0 warning(s)
sec 2.7.261-beta-080905
-  sec.properties
+  sec.plugins

<- io/term/tests/term_scenario.sei
generate:
-> io/term/tests/term_scenario.c
0 error(s), 0 warning(s)
sec 2.7.261-beta-080905
-  sec.properties
+  sec.plugins

<- io/term/tests/tty_scenario.sei
generate:
-> io/term/tests/tty_scenario.c
0 error(s), 0 warning(s)
sec 2.7.261-beta-080905
-  sec.properties
+  sec.plugins

<- io/pipe/pipe_media.sei
generate:
-> io/pipe/pipe_media.c
0 error(s), 0 warning(s)
sec 2.7.261-beta-080905
-  sec.properties
+  sec.plugins

<- io/pipe/pipe_model.sei
generate:
-> io/pipe/pipe_model.c
0 error(s), 0 warning(s)
sec 2.7.261-beta-080905
-  sec.properties
+  sec.plugins

<- io/pipe/tests/pipe_main.sei
generate:
-> io/pipe/tests/pipe_main.c
0 error(s), 0 warning(s)
sec 2.7.261-beta-080905
-  sec.properties
+  sec.plugins

<- io/pipe/tests/pipe_scenario.sei
generate:
-> io/pipe/tests/pipe_scenario.c
0 error(s), 0 warning(s)
sec 2.7.261-beta-080905
-  sec.properties
+  sec.plugins

<- io/fstream/buffer_media.sei
generate:
-> io/fstream/buffer_media.c
0 error(s), 0 warning(s)
sec 2.7.261-beta-080905
-  sec.properties
+  sec.plugins

<- io/fstream/buffer_model.sei
generate:
-> io/fstream/buffer_model.c
0 error(s), 0 warning(s)
sec 2.7.261-beta-080905
-  sec.properties
+  sec.plugins

<- io/fstream/fstream_media.sei
generate:
-> io/fstream/fstream_media.c
0 error(s), 0 warning(s)
sec 2.7.261-beta-080905
-  sec.properties
+  sec.plugins

<- io/fstream/fstream_model.sei
generate:
-> io/fstream/fstream_model.c
0 error(s), 0 warning(s)
sec 2.7.261-beta-080905
-  sec.properties
+  sec.plugins

<- io/fstream/lock_media.sei
generate:
-> io/fstream/lock_media.c
0 error(s), 0 warning(s)
sec 2.7.261-beta-080905
-  sec.properties
+  sec.plugins

<- io/fstream/lock_model.sei
generate:
-> io/fstream/lock_model.c
0 error(s), 0 warning(s)
sec 2.7.261-beta-080905
-  sec.properties
+  sec.plugins

<- io/fstream/wstream_media.sei
generate:
-> io/fstream/wstream_media.c
0 error(s), 0 warning(s)
sec 2.7.261-beta-080905
-  sec.properties
+  sec.plugins

<- io/fstream/wstream_model.sei
generate:
-> io/fstream/wstream_model.c
0 error(s), 0 warning(s)
sec 2.7.261-beta-080905
-  sec.properties
+  sec.plugins

<- io/fstream/tests/buffer_scenario.sei
generate:
-> io/fstream/tests/buffer_scenario.c
0 error(s), 0 warning(s)
sec 2.7.261-beta-080905
-  sec.properties
+  sec.plugins

<- io/fstream/tests/fstream_main.sei
generate:
-> io/fstream/tests/fstream_main.c
0 error(s), 0 warning(s)
sec 2.7.261-beta-080905
-  sec.properties
+  sec.plugins

<- io/fstream/tests/fstream_scenario.sei
generate:
-> io/fstream/tests/fstream_scenario.c
0 error(s), 0 warning(s)
sec 2.7.261-beta-080905
-  sec.properties
+  sec.plugins

<- io/fstream/tests/lock_scenario.sei
generate:
-> io/fstream/tests/lock_scenario.c
0 error(s), 0 warning(s)
sec 2.7.261-beta-080905
-  sec.properties
+  sec.plugins

<- io/fstream/tests/wstream_scenario.sei
generate:
-> io/fstream/tests/wstream_scenario.c
0 error(s), 0 warning(s)
sec 2.7.261-beta-080905
-  sec.properties
+  sec.plugins

<- io/multiplex/multiplex_media.sei
generate:
-> io/multiplex/multiplex_media.c
0 error(s), 0 warning(s)
sec 2.7.261-beta-080905
-  sec.properties
+  sec.plugins

<- io/multiplex/multiplex_model.sei
generate:
-> io/multiplex/multiplex_model.c
0 error(s), 0 warning(s)
sec 2.7.261-beta-080905
-  sec.properties
+  sec.plugins

<- io/multiplex/tests/multiplex_main.sei
generate:
-> io/multiplex/tests/multiplex_main.c
0 error(s), 0 warning(s)
sec 2.7.261-beta-080905
-  sec.properties
+  sec.plugins

<- io/multiplex/tests/multiplex_scenario.sei
generate:
-> io/multiplex/tests/multiplex_scenario.c
0 error(s), 0 warning(s)
sec 2.7.261-beta-080905
-  sec.properties
+  sec.plugins

<- io/streams/streams_media.sei
generate:
-> io/streams/streams_media.c
0 error(s), 0 warning(s)
sec 2.7.261-beta-080905
-  sec.properties
+  sec.plugins

<- io/streams/streams_model.sei
generate:
-> io/streams/streams_model.c
0 error(s), 0 warning(s)
sec 2.7.261-beta-080905
-  sec.properties
+  sec.plugins

<- io/streams/tests/streams_main.sei
generate:
-> io/streams/tests/streams_main.c
0 error(s), 0 warning(s)
sec 2.7.261-beta-080905
-  sec.properties
+  sec.plugins

<- io/streams/tests/streams_scenario.sei
generate:
-> io/streams/tests/streams_scenario.c
0 error(s), 0 warning(s)
sec 2.7.261-beta-080905
-  sec.properties
+  sec.plugins

<- io/syslog/syslog_media.sei
generate:
-> io/syslog/syslog_media.c
0 error(s), 0 warning(s)
sec 2.7.261-beta-080905
-  sec.properties
+  sec.plugins

<- io/syslog/syslog_model.sei
generate:
-> io/syslog/syslog_model.c
0 error(s), 0 warning(s)
sec 2.7.261-beta-080905
-  sec.properties
+  sec.plugins

<- io/syslog/tests/syslog_main.sei
generate:
-> io/syslog/tests/syslog_main.c
0 error(s), 0 warning(s)
sec 2.7.261-beta-080905
-  sec.properties
+  sec.plugins

<- io/syslog/tests/syslog_scenario.sei
generate:
-> io/syslog/tests/syslog_scenario.c
0 error(s), 0 warning(s)
sec 2.7.261-beta-080905
-  sec.properties
+  sec.plugins

<- memory/heap/heap_media.sei
generate:
-> memory/heap/heap_media.c
0 error(s), 0 warning(s)
sec 2.7.261-beta-080905
-  sec.properties
+  sec.plugins

<- memory/heap/heap_model.sei
generate:
-> memory/heap/heap_model.c
0 error(s), 0 warning(s)
sec 2.7.261-beta-080905
-  sec.properties
+  sec.plugins

<- memory/heap/tests/heap_main.sei
generate:
-> memory/heap/tests/heap_main.c
0 error(s), 0 warning(s)
sec 2.7.261-beta-080905
-  sec.properties
+  sec.plugins

<- memory/heap/tests/heap_scenario.sei
generate:
-> memory/heap/tests/heap_scenario.c
0 error(s), 0 warning(s)
sec 2.7.261-beta-080905
-  sec.properties
+  sec.plugins

<- memory/heap/tests/memory_scenario.sei
generate:
-> memory/heap/tests/memory_scenario.c
0 error(s), 0 warning(s)
sec 2.7.261-beta-080905
-  sec.properties
+  sec.plugins

<- memory/mman/mman_media.sei
generate:
-> memory/mman/mman_media.c
0 error(s), 0 warning(s)
sec 2.7.261-beta-080905
-  sec.properties
+  sec.plugins

<- memory/mman/mman_model.sei
generate:
-> memory/mman/mman_model.c
0 error(s), 0 warning(s)
sec 2.7.261-beta-080905
-  sec.properties
+  sec.plugins

<- memory/mman/tests/mman_b1_scenario.sei
generate:
-> memory/mman/tests/mman_b1_scenario.c
0 error(s), 0 warning(s)
sec 2.7.261-beta-080905
-  sec.properties
+  sec.plugins

<- memory/mman/tests/mman_errors_scenario.sei
generate:
-> memory/mman/tests/mman_errors_scenario.c
0 error(s), 0 warning(s)
sec 2.7.261-beta-080905
-  sec.properties
+  sec.plugins

<- memory/mman/tests/mman_main.sei
generate:
-> memory/mman/tests/mman_main.c
0 error(s), 0 warning(s)
sec 2.7.261-beta-080905
-  sec.properties
+  sec.plugins

<- memory/mman/tests/mman_scenario.sei
generate:
-> memory/mman/tests/mman_scenario.c
0 error(s), 0 warning(s)
sec 2.7.261-beta-080905
-  sec.properties
+  sec.plugins

<- memory/mman/tests/mman_usualuse_scenario.sei
generate:
-> memory/mman/tests/mman_usualuse_scenario.c
0 error(s), 0 warning(s)
sec 2.7.261-beta-080905
-  sec.properties
+  sec.plugins

<- memory/break/break_media.sei
generate:
-> memory/break/break_media.c
0 error(s), 0 warning(s)
sec 2.7.261-beta-080905
-  sec.properties
+  sec.plugins

<- memory/break/break_model.sei
generate:
-> memory/break/break_model.c
0 error(s), 0 warning(s)
sec 2.7.261-beta-080905
-  sec.properties
+  sec.plugins

<- memory/break/tests/break_main.sei
generate:
-> memory/break/tests/break_main.c
0 error(s), 0 warning(s)
sec 2.7.261-beta-080905
-  sec.properties
+  sec.plugins

<- memory/break/tests/break_scenario.sei
generate:
-> memory/break/tests/break_scenario.c
0 error(s), 0 warning(s)
sec 2.7.261-beta-080905
-  sec.properties
+  sec.plugins

<- process/process/process_common.sei
generate:
-> process/process/process_common.c
0 error(s), 0 warning(s)
sec 2.7.261-beta-080905
-  sec.properties
+  sec.plugins

<- process/process/process_media.sei
generate:
-> process/process/process_media.c
0 error(s), 0 warning(s)
sec 2.7.261-beta-080905
-  sec.properties
+  sec.plugins

<- process/process/process_model.sei
generate:
-> process/process/process_model.c
0 error(s), 0 warning(s)
sec 2.7.261-beta-080905
-  sec.properties
+  sec.plugins

<- process/process/tests/process_main.sei
generate:
-> process/process/tests/process_main.c
0 error(s), 0 warning(s)
sec 2.7.261-beta-080905
-  sec.properties
+  sec.plugins

<- process/process/tests/process_scenario.sei
generate:
-> process/process/tests/process_scenario.c
0 error(s), 0 warning(s)
sec 2.7.261-beta-080905
-  sec.properties
+  sec.plugins

<- process/fenv/fenv_common.sei
generate:
-> process/fenv/fenv_common.c
0 error(s), 0 warning(s)
sec 2.7.261-beta-080905
-  sec.properties
+  sec.plugins

<- process/fenv/fenv_media.sei
generate:
-> process/fenv/fenv_media.c
0 error(s), 0 warning(s)
sec 2.7.261-beta-080905
-  sec.properties
+  sec.plugins

<- process/fenv/fenv_model.sei
generate:
-> process/fenv/fenv_model.c
0 error(s), 0 warning(s)
sec 2.7.261-beta-080905
-  sec.properties
+  sec.plugins

<- process/fenv/tests/fenv_main.sei
generate:
-> process/fenv/tests/fenv_main.c
0 error(s), 0 warning(s)
sec 2.7.261-beta-080905
-  sec.properties
+  sec.plugins

<- process/fenv/tests/fenv_scenario.sei
generate:
-> process/fenv/tests/fenv_scenario.c
0 error(s), 0 warning(s)
sec 2.7.261-beta-080905
-  sec.properties
+  sec.plugins

<- process/meta/fs_media.sei
generate:
-> process/meta/fs_media.c
0 error(s), 0 warning(s)
sec 2.7.261-beta-080905
-  sec.properties
+  sec.plugins

<- process/meta/fs_model.sei
generate:
-> process/meta/fs_model.c
0 error(s), 0 warning(s)
sec 2.7.261-beta-080905
-  sec.properties
+  sec.plugins

<- process/meta/meta_media.sei
generate:
-> process/meta/meta_media.c
0 error(s), 0 warning(s)
sec 2.7.261-beta-080905
-  sec.properties
+  sec.plugins

<- process/meta/meta_model.sei
generate:
-> process/meta/meta_model.c
0 error(s), 0 warning(s)
sec 2.7.261-beta-080905
-  sec.properties
+  sec.plugins

<- process/meta/nice_media.sei
generate:
-> process/meta/nice_media.c
0 error(s), 0 warning(s)
sec 2.7.261-beta-080905
-  sec.properties
+  sec.plugins

<- process/meta/nice_model.sei
generate:
-> process/meta/nice_model.c
0 error(s), 0 warning(s)
sec 2.7.261-beta-080905
-  sec.properties
+  sec.plugins

<- process/meta/user_media.sei
generate:
-> process/meta/user_media.c
0 error(s), 0 warning(s)
sec 2.7.261-beta-080905
-  sec.properties
+  sec.plugins

<- process/meta/user_model.sei
generate:
-> process/meta/user_model.c
0 error(s), 0 warning(s)
sec 2.7.261-beta-080905
-  sec.properties
+  sec.plugins

<- process/meta/tests/fs_scenario.sei
generate:
-> process/meta/tests/fs_scenario.c
0 error(s), 0 warning(s)
sec 2.7.261-beta-080905
-  sec.properties
+  sec.plugins

<- process/meta/tests/meta_main.sei
generate:
-> process/meta/tests/meta_main.c
0 error(s), 0 warning(s)
sec 2.7.261-beta-080905
-  sec.properties
+  sec.plugins

<- process/meta/tests/meta_scenario.sei
generate:
-> process/meta/tests/meta_scenario.c
0 error(s), 0 warning(s)
sec 2.7.261-beta-080905
-  sec.properties
+  sec.plugins

<- process/meta/tests/nice_scenario.sei
generate:
-> process/meta/tests/nice_scenario.c
0 error(s), 0 warning(s)
sec 2.7.261-beta-080905
-  sec.properties
+  sec.plugins

<- process/meta/tests/user_scenario.sei
generate:
-> process/meta/tests/user_scenario.c
0 error(s), 0 warning(s)
sec 2.7.261-beta-080905
-  sec.properties
+  sec.plugins

<- process/environ/environ_media.sei
generate:
-> process/environ/environ_media.c
0 error(s), 0 warning(s)
sec 2.7.261-beta-080905
-  sec.properties
+  sec.plugins

<- process/environ/environ_model.sei
generate:
-> process/environ/environ_model.c
0 error(s), 0 warning(s)
sec 2.7.261-beta-080905
-  sec.properties
+  sec.plugins

<- process/environ/tests/environ_main.sei
generate:
-> process/environ/tests/environ_main.c
0 error(s), 0 warning(s)
sec 2.7.261-beta-080905
-  sec.properties
+  sec.plugins

<- process/environ/tests/environ_scenario.sei
generate:
-> process/environ/tests/environ_scenario.c
0 error(s), 0 warning(s)
sec 2.7.261-beta-080905
-  sec.properties
+  sec.plugins

<- process/context/context_media.sei
generate:
-> process/context/context_media.c
0 error(s), 0 warning(s)
sec 2.7.261-beta-080905
-  sec.properties
+  sec.plugins

<- process/context/context_model.sei
generate:
-> process/context/context_model.c
0 error(s), 0 warning(s)
sec 2.7.261-beta-080905
-  sec.properties
+  sec.plugins

<- process/context/tests/context_main.sei
generate:
-> process/context/tests/context_main.c
0 error(s), 0 warning(s)
sec 2.7.261-beta-080905
-  sec.properties
+  sec.plugins

<- process/context/tests/context_scenario.sei
generate:
-> process/context/tests/context_scenario.c
0 error(s), 0 warning(s)
sec 2.7.261-beta-080905
-  sec.properties
+  sec.plugins

<- process/goto/goto_media.sei
generate:
-> process/goto/goto_media.c
0 error(s), 0 warning(s)
sec 2.7.261-beta-080905
-  sec.properties
+  sec.plugins

<- process/goto/goto_model.sei
generate:
-> process/goto/goto_model.c
0 error(s), 0 warning(s)
sec 2.7.261-beta-080905
-  sec.properties
+  sec.plugins

<- process/goto/tests/goto_main.sei
generate:
-> process/goto/tests/goto_main.c
0 error(s), 0 warning(s)
sec 2.7.261-beta-080905
-  sec.properties
+  sec.plugins

<- process/goto/tests/goto_scenario.sei
generate:
-> process/goto/tests/goto_scenario.c
0 error(s), 0 warning(s)
sec 2.7.261-beta-080905
-  sec.properties
+  sec.plugins

<- process/ipc/ipc_media.sei
generate:
-> process/ipc/ipc_media.c
0 error(s), 0 warning(s)
sec 2.7.261-beta-080905
-  sec.properties
+  sec.plugins

<- process/ipc/ipc_model.sei
generate:
-> process/ipc/ipc_model.c
0 error(s), 0 warning(s)
sec 2.7.261-beta-080905
-  sec.properties
+  sec.plugins

<- process/ipc/msg_media.sei
generate:
-> process/ipc/msg_media.c
0 error(s), 0 warning(s)
sec 2.7.261-beta-080905
-  sec.properties
+  sec.plugins

<- process/ipc/msg_model.sei
generate:
-> process/ipc/msg_model.c
0 error(s), 0 warning(s)
sec 2.7.261-beta-080905
-  sec.properties
+  sec.plugins

<- process/ipc/sem_media.sei
generate:
-> process/ipc/sem_media.c
0 error(s), 0 warning(s)
sec 2.7.261-beta-080905
-  sec.properties
+  sec.plugins

<- process/ipc/sem_model.sei
generate:
-> process/ipc/sem_model.c
0 error(s), 0 warning(s)
sec 2.7.261-beta-080905
-  sec.properties
+  sec.plugins

<- process/ipc/shm_media.sei
generate:
-> process/ipc/shm_media.c
0 error(s), 0 warning(s)
sec 2.7.261-beta-080905
-  sec.properties
+  sec.plugins

<- process/ipc/shm_model.sei
generate:
-> process/ipc/shm_model.c
0 error(s), 0 warning(s)
sec 2.7.261-beta-080905
-  sec.properties
+  sec.plugins

<- process/ipc/tests/ipc_main.sei
generate:
-> process/ipc/tests/ipc_main.c
0 error(s), 0 warning(s)
sec 2.7.261-beta-080905
-  sec.properties
+  sec.plugins

<- process/ipc/tests/ipc_scenario.sei
generate:
-> process/ipc/tests/ipc_scenario.c
0 error(s), 0 warning(s)
sec 2.7.261-beta-080905
-  sec.properties
+  sec.plugins

<- process/ipc/tests/msg_scenario.sei
generate:
-> process/ipc/tests/msg_scenario.c
0 error(s), 0 warning(s)
sec 2.7.261-beta-080905
-  sec.properties
+  sec.plugins

<- process/ipc/tests/sem_scenario.sei
generate:
-> process/ipc/tests/sem_scenario.c
0 error(s), 0 warning(s)
sec 2.7.261-beta-080905
-  sec.properties
+  sec.plugins

<- process/ipc/tests/shm_scenario.sei
generate:
-> process/ipc/tests/shm_scenario.c
0 error(s), 0 warning(s)
sec 2.7.261-beta-080905
-  sec.properties
+  sec.plugins

<- process/pgroup/pgroup_media.sei
generate:
-> process/pgroup/pgroup_media.c
0 error(s), 0 warning(s)
sec 2.7.261-beta-080905
-  sec.properties
+  sec.plugins

<- process/pgroup/pgroup_model.sei
generate:
-> process/pgroup/pgroup_model.c
0 error(s), 0 warning(s)
sec 2.7.261-beta-080905
-  sec.properties
+  sec.plugins

<- process/pgroup/tests/pgroup_main.sei
generate:
-> process/pgroup/tests/pgroup_main.c
0 error(s), 0 warning(s)
sec 2.7.261-beta-080905
-  sec.properties
+  sec.plugins

<- process/pgroup/tests/pgroup_scenario.sei
generate:
-> process/pgroup/tests/pgroup_scenario.c
0 error(s), 0 warning(s)
sec 2.7.261-beta-080905
-  sec.properties
+  sec.plugins

<- process/resources/resources_media.sei
generate:
-> process/resources/resources_media.c
0 error(s), 0 warning(s)
sec 2.7.261-beta-080905
-  sec.properties
+  sec.plugins

<- process/resources/resources_model.sei
generate:
-> process/resources/resources_model.c
0 error(s), 0 warning(s)
sec 2.7.261-beta-080905
-  sec.properties
+  sec.plugins

<- process/resources/tests/resources_main.sei
generate:
-> process/resources/tests/resources_main.c
0 error(s), 0 warning(s)
sec 2.7.261-beta-080905
-  sec.properties
+  sec.plugins

<- process/resources/tests/resources_scenario.sei
generate:
-> process/resources/tests/resources_scenario.c
0 error(s), 0 warning(s)
sec 2.7.261-beta-080905
-  sec.properties
+  sec.plugins

<- process/scheduler/scheduler_media.sei
generate:
-> process/scheduler/scheduler_media.c
0 error(s), 0 warning(s)
sec 2.7.261-beta-080905
-  sec.properties
+  sec.plugins

<- process/scheduler/scheduler_model.sei
generate:
-> process/scheduler/scheduler_model.c
0 error(s), 0 warning(s)
sec 2.7.261-beta-080905
-  sec.properties
+  sec.plugins

<- process/scheduler/tests/scheduler_main.sei
generate:
-> process/scheduler/tests/scheduler_main.c
0 error(s), 0 warning(s)
sec 2.7.261-beta-080905
-  sec.properties
+  sec.plugins

<- process/scheduler/tests/scheduler_scenario.sei
generate:
-> process/scheduler/tests/scheduler_scenario.c
0 error(s), 0 warning(s)
sec 2.7.261-beta-080905
-  sec.properties
+  sec.plugins

<- pthread/mutex/mutexattr_media.sei
generate:
-> pthread/mutex/mutexattr_media.c
0 error(s), 0 warning(s)
sec 2.7.261-beta-080905
-  sec.properties
+  sec.plugins

<- pthread/mutex/mutexattr_model.sei
generate:
-> pthread/mutex/mutexattr_model.c
0 error(s), 0 warning(s)
sec 2.7.261-beta-080905
-  sec.properties
+  sec.plugins

<- pthread/mutex/mutex_media.sei
generate:
-> pthread/mutex/mutex_media.c
0 error(s), 0 warning(s)
sec 2.7.261-beta-080905
-  sec.properties
+  sec.plugins

<- pthread/mutex/mutex_model.sei
generate:
-> pthread/mutex/mutex_model.c
0 error(s), 0 warning(s)
sec 2.7.261-beta-080905
-  sec.properties
+  sec.plugins

<- pthread/mutex/tests/mutexattr_scenario.sei
generate:
-> pthread/mutex/tests/mutexattr_scenario.c
0 error(s), 0 warning(s)
sec 2.7.261-beta-080905
-  sec.properties
+  sec.plugins

<- pthread/mutex/tests/mutex_main.sei
generate:
-> pthread/mutex/tests/mutex_main.c
0 error(s), 0 warning(s)
sec 2.7.261-beta-080905
-  sec.properties
+  sec.plugins

<- pthread/mutex/tests/mutex_mixed_scenario.sei
generate:
-> pthread/mutex/tests/mutex_mixed_scenario.c
0 error(s), 0 warning(s)
sec 2.7.261-beta-080905
-  sec.properties
+  sec.plugins

<- pthread/mutex/tests/mutex_mixed_types_scenario.sei
generate:
-> pthread/mutex/tests/mutex_mixed_types_scenario.c
0 error(s), 0 warning(s)
sec 2.7.261-beta-080905
-  sec.properties
+  sec.plugins

<- pthread/mutex/tests/mutex_scenario.sei
generate:
-> pthread/mutex/tests/mutex_scenario.c
0 error(s), 0 warning(s)
sec 2.7.261-beta-080905
-  sec.properties
+  sec.plugins

<- pthread/mutex/tests/mutex_simple_scenario.sei
generate:
-> pthread/mutex/tests/mutex_simple_scenario.c
0 error(s), 0 warning(s)
sec 2.7.261-beta-080905
-  sec.properties
+  sec.plugins

<- pthread/mutex/tests/mutex_static_init_scenario.sei
generate:
-> pthread/mutex/tests/mutex_static_init_scenario.c
0 error(s), 0 warning(s)
sec 2.7.261-beta-080905
-  sec.properties
+  sec.plugins

<- pthread/pthread/pthread_media.sei
generate:
-> pthread/pthread/pthread_media.c
0 error(s), 0 warning(s)
sec 2.7.261-beta-080905
-  sec.properties
+  sec.plugins

<- pthread/pthread/pthread_model.sei
generate:
-> pthread/pthread/pthread_model.c
0 error(s), 0 warning(s)
sec 2.7.261-beta-080905
-  sec.properties
+  sec.plugins

<- pthread/pthread/tests/pthread_cleanup_diff_scenario.sei
generate:
-> pthread/pthread/tests/pthread_cleanup_diff_scenario.c
0 error(s), 0 warning(s)
sec 2.7.261-beta-080905
-  sec.properties
+  sec.plugins

<- pthread/pthread/tests/pthread_cleanup_simple_scenario.sei
generate:
-> pthread/pthread/tests/pthread_cleanup_simple_scenario.c
0 error(s), 0 warning(s)
sec 2.7.261-beta-080905
-  sec.properties
+  sec.plugins

<- pthread/pthread/tests/pthread_create_cancel_scenario.sei
generate:
-> pthread/pthread/tests/pthread_create_cancel_scenario.c
0 error(s), 0 warning(s)
sec 2.7.261-beta-080905
-  sec.properties
+  sec.plugins

<- pthread/pthread/tests/pthread_exit_join_scenario.sei
generate:
-> pthread/pthread/tests/pthread_exit_join_scenario.c
0 error(s), 0 warning(s)
sec 2.7.261-beta-080905
-  sec.properties
+  sec.plugins

<- pthread/pthread/tests/pthread_main.sei
generate:
-> pthread/pthread/tests/pthread_main.c
0 error(s), 0 warning(s)
sec 2.7.261-beta-080905
-  sec.properties
+  sec.plugins

<- pthread/pthread/tests/pthread_scenario.sei
generate:
-> pthread/pthread/tests/pthread_scenario.c
0 error(s), 0 warning(s)
sec 2.7.261-beta-080905
-  sec.properties
+  sec.plugins

<- pthread/attr/attr_media.sei
generate:
-> pthread/attr/attr_media.c
0 error(s), 0 warning(s)
sec 2.7.261-beta-080905
-  sec.properties
+  sec.plugins

<- pthread/attr/attr_model.sei
generate:
-> pthread/attr/attr_model.c
0 error(s), 0 warning(s)
sec 2.7.261-beta-080905
-  sec.properties
+  sec.plugins

<- pthread/attr/tests/attr_main.sei
generate:
-> pthread/attr/tests/attr_main.c
0 error(s), 0 warning(s)
sec 2.7.261-beta-080905
-  sec.properties
+  sec.plugins

<- pthread/attr/tests/attr_scenario.sei
generate:
-> pthread/attr/tests/attr_scenario.c
0 error(s), 0 warning(s)
sec 2.7.261-beta-080905
-  sec.properties
+  sec.plugins

<- pthread/rwlock/rwlockattr_media.sei
generate:
-> pthread/rwlock/rwlockattr_media.c
0 error(s), 0 warning(s)
sec 2.7.261-beta-080905
-  sec.properties
+  sec.plugins

<- pthread/rwlock/rwlockattr_model.sei
generate:
-> pthread/rwlock/rwlockattr_model.c
0 error(s), 0 warning(s)
sec 2.7.261-beta-080905
-  sec.properties
+  sec.plugins

<- pthread/rwlock/rwlock_media.sei
generate:
-> pthread/rwlock/rwlock_media.c
0 error(s), 0 warning(s)
sec 2.7.261-beta-080905
-  sec.properties
+  sec.plugins

<- pthread/rwlock/rwlock_model.sei
generate:
-> pthread/rwlock/rwlock_model.c
0 error(s), 0 warning(s)
sec 2.7.261-beta-080905
-  sec.properties
+  sec.plugins

<- pthread/rwlock/tests/rwlockattr_scenario.sei
generate:
-> pthread/rwlock/tests/rwlockattr_scenario.c
0 error(s), 0 warning(s)
sec 2.7.261-beta-080905
-  sec.properties
+  sec.plugins

<- pthread/rwlock/tests/rwlock_deadlock_scenario.sei
generate:
-> pthread/rwlock/tests/rwlock_deadlock_scenario.c
0 error(s), 0 warning(s)
sec 2.7.261-beta-080905
-  sec.properties
+  sec.plugins

<- pthread/rwlock/tests/rwlock_errors_scenario.sei
generate:
-> pthread/rwlock/tests/rwlock_errors_scenario.c
0 error(s), 0 warning(s)
sec 2.7.261-beta-080905
-  sec.properties
+  sec.plugins

<- pthread/rwlock/tests/rwlock_init_destroy_scenario.sei
generate:
-> pthread/rwlock/tests/rwlock_init_destroy_scenario.c
0 error(s), 0 warning(s)
sec 2.7.261-beta-080905
-  sec.properties
+  sec.plugins

<- pthread/rwlock/tests/rwlock_main.sei
generate:
-> pthread/rwlock/tests/rwlock_main.c
0 error(s), 0 warning(s)
sec 2.7.261-beta-080905
-  sec.properties
+  sec.plugins

<- pthread/rwlock/tests/rwlock_N_rwlock_light_scenario.sei
generate:
-> pthread/rwlock/tests/rwlock_N_rwlock_light_scenario.c
0 error(s), 0 warning(s)
sec 2.7.261-beta-080905
-  sec.properties
+  sec.plugins

<- pthread/rwlock/tests/rwlock_N_rwlock_scenario.sei
generate:
-> pthread/rwlock/tests/rwlock_N_rwlock_scenario.c
0 error(s), 0 warning(s)
sec 2.7.261-beta-080905
-  sec.properties
+  sec.plugins

<- pthread/rwlock/tests/rwlock_repeated_lock_scenario.sei
generate:
-> pthread/rwlock/tests/rwlock_repeated_lock_scenario.c
0 error(s), 0 warning(s)
sec 2.7.261-beta-080905
-  sec.properties
+  sec.plugins

<- pthread/rwlock/tests/rwlock_scenario.sei
generate:
-> pthread/rwlock/tests/rwlock_scenario.c
0 error(s), 0 warning(s)
sec 2.7.261-beta-080905
-  sec.properties
+  sec.plugins

<- pthread/rwlock/tests/rwlock_single_rwlock_scenario.sei
generate:
-> pthread/rwlock/tests/rwlock_single_rwlock_scenario.c
0 error(s), 0 warning(s)
sec 2.7.261-beta-080905
-  sec.properties
+  sec.plugins

<- pthread/scheduler/scheduler_media.sei
generate:
-> pthread/scheduler/scheduler_media.c
0 error(s), 0 warning(s)
sec 2.7.261-beta-080905
-  sec.properties
+  sec.plugins

<- pthread/scheduler/scheduler_model.sei
generate:
-> pthread/scheduler/scheduler_model.c
0 error(s), 0 warning(s)
sec 2.7.261-beta-080905
-  sec.properties
+  sec.plugins

<- pthread/scheduler/tests/scheduler_main.sei
generate:
-> pthread/scheduler/tests/scheduler_main.c
0 error(s), 0 warning(s)
sec 2.7.261-beta-080905
-  sec.properties
+  sec.plugins

<- pthread/scheduler/tests/scheduler_scenario.sei
generate:
-> pthread/scheduler/tests/scheduler_scenario.c
0 error(s), 0 warning(s)
sec 2.7.261-beta-080905
-  sec.properties
+  sec.plugins

<- pthread/cond/condattr_media.sei
generate:
-> pthread/cond/condattr_media.c
0 error(s), 0 warning(s)
sec 2.7.261-beta-080905
-  sec.properties
+  sec.plugins

<- pthread/cond/condattr_model.sei
generate:
-> pthread/cond/condattr_model.c
0 error(s), 0 warning(s)
sec 2.7.261-beta-080905
-  sec.properties
+  sec.plugins

<- pthread/cond/cond_media.sei
generate:
-> pthread/cond/cond_media.c
0 error(s), 0 warning(s)
sec 2.7.261-beta-080905
-  sec.properties
+  sec.plugins

<- pthread/cond/cond_model.sei
generate:
-> pthread/cond/cond_model.c
0 error(s), 0 warning(s)
sec 2.7.261-beta-080905
-  sec.properties
+  sec.plugins

<- pthread/cond/tests/condattr_scenario.sei
generate:
-> pthread/cond/tests/condattr_scenario.c
0 error(s), 0 warning(s)
sec 2.7.261-beta-080905
-  sec.properties
+  sec.plugins

<- pthread/cond/tests/cond_error_scenario.sei
generate:
-> pthread/cond/tests/cond_error_scenario.c
0 error(s), 0 warning(s)
sec 2.7.261-beta-080905
-  sec.properties
+  sec.plugins

<- pthread/cond/tests/cond_init_destroy_scenario.sei
generate:
-> pthread/cond/tests/cond_init_destroy_scenario.c
0 error(s), 0 warning(s)
sec 2.7.261-beta-080905
-  sec.properties
+  sec.plugins

<- pthread/cond/tests/cond_main.sei
generate:
-> pthread/cond/tests/cond_main.c
0 error(s), 0 warning(s)
sec 2.7.261-beta-080905
-  sec.properties
+  sec.plugins

<- pthread/cond/tests/cond_scenario.sei
generate:
-> pthread/cond/tests/cond_scenario.c
0 error(s), 0 warning(s)
sec 2.7.261-beta-080905
-  sec.properties
+  sec.plugins

<- pthread/cond/tests/cond_single_cond_scenario.sei
generate:
-> pthread/cond/tests/cond_single_cond_scenario.c
0 error(s), 0 warning(s)
sec 2.7.261-beta-080905
-  sec.properties
+  sec.plugins

<- pthread/sem/sem_media.sei
generate:
-> pthread/sem/sem_media.c
0 error(s), 0 warning(s)
sec 2.7.261-beta-080905
-  sec.properties
+  sec.plugins

<- pthread/sem/sem_model.sei
generate:
-> pthread/sem/sem_model.c
0 error(s), 0 warning(s)
sec 2.7.261-beta-080905
-  sec.properties
+  sec.plugins

<- pthread/sem/tests/sem_complex_scenario.sei
generate:
-> pthread/sem/tests/sem_complex_scenario.c
0 error(s), 0 warning(s)
sec 2.7.261-beta-080905
-  sec.properties
+  sec.plugins

<- pthread/sem/tests/sem_error_scenario.sei
generate:
-> pthread/sem/tests/sem_error_scenario.c
0 error(s), 0 warning(s)
sec 2.7.261-beta-080905
-  sec.properties
+  sec.plugins

<- pthread/sem/tests/sem_main.sei
generate:
-> pthread/sem/tests/sem_main.c
0 error(s), 0 warning(s)
sec 2.7.261-beta-080905
-  sec.properties
+  sec.plugins

<- pthread/sem/tests/sem_open_close_scenario.sei
generate:
-> pthread/sem/tests/sem_open_close_scenario.c
0 error(s), 0 warning(s)
sec 2.7.261-beta-080905
-  sec.properties
+  sec.plugins

<- pthread/sem/tests/sem_scenario.sei
generate:
-> pthread/sem/tests/sem_scenario.c
0 error(s), 0 warning(s)
sec 2.7.261-beta-080905
-  sec.properties
+  sec.plugins

<- pthread/tls/tls_media.sei
generate:
-> pthread/tls/tls_media.c
0 error(s), 0 warning(s)
sec 2.7.261-beta-080905
-  sec.properties
+  sec.plugins

<- pthread/tls/tls_model.sei
generate:
-> pthread/tls/tls_model.c
0 error(s), 0 warning(s)
sec 2.7.261-beta-080905
-  sec.properties
+  sec.plugins

<- pthread/tls/tests/tls_main.sei
generate:
-> pthread/tls/tests/tls_main.c
0 error(s), 0 warning(s)
sec 2.7.261-beta-080905
-  sec.properties
+  sec.plugins

<- pthread/tls/tests/tls_scenario.sei
generate:
-> pthread/tls/tests/tls_scenario.c
0 error(s), 0 warning(s)
sec 2.7.261-beta-080905
-  sec.properties
+  sec.plugins

<- system/system/system_model.sei
generate:
-> system/system/system_model.c
0 error(s), 0 warning(s)
sec 2.7.261-beta-080905
-  sec.properties
+  sec.plugins

<- system/sysconf/sysconf_media.sei
generate:
-> system/sysconf/sysconf_media.c
0 error(s), 0 warning(s)
sec 2.7.261-beta-080905
-  sec.properties
+  sec.plugins

<- system/sysconf/sysconf_model.sei
generate:
-> system/sysconf/sysconf_model.c
0 error(s), 0 warning(s)
sec 2.7.261-beta-080905
-  sec.properties
+  sec.plugins

<- system/sysconf/tests/sysconf_main.sei
generate:
-> system/sysconf/tests/sysconf_main.c
0 error(s), 0 warning(s)
sec 2.7.261-beta-080905
-  sec.properties
+  sec.plugins

<- system/sysconf/tests/sysconf_scenario.sei
generate:
-> system/sysconf/tests/sysconf_scenario.c
0 error(s), 0 warning(s)
sec 2.7.261-beta-080905
-  sec.properties
+  sec.plugins

<- system/user/account_media.sei
generate:
-> system/user/account_media.c
0 error(s), 0 warning(s)
sec 2.7.261-beta-080905
-  sec.properties
+  sec.plugins

<- system/user/account_model.sei
generate:
-> system/user/account_model.c
0 error(s), 0 warning(s)
sec 2.7.261-beta-080905
-  sec.properties
+  sec.plugins

<- system/user/group_media.sei
generate:
-> system/user/group_media.c
0 error(s), 0 warning(s)
sec 2.7.261-beta-080905
-  sec.properties
+  sec.plugins

<- system/user/group_model.sei
generate:
-> system/user/group_model.c
0 error(s), 0 warning(s)
sec 2.7.261-beta-080905
-  sec.properties
+  sec.plugins

<- system/user/user_media.sei
generate:
-> system/user/user_media.c
0 error(s), 0 warning(s)
sec 2.7.261-beta-080905
-  sec.properties
+  sec.plugins

<- system/user/user_model.sei
generate:
-> system/user/user_model.c
0 error(s), 0 warning(s)
sec 2.7.261-beta-080905
-  sec.properties
+  sec.plugins

<- system/user/tests/account_scenario.sei
generate:
-> system/user/tests/account_scenario.c
0 error(s), 0 warning(s)
sec 2.7.261-beta-080905
-  sec.properties
+  sec.plugins

<- system/user/tests/group_scenario.sei
generate:
-> system/user/tests/group_scenario.c
0 error(s), 0 warning(s)
sec 2.7.261-beta-080905
-  sec.properties
+  sec.plugins

<- system/user/tests/user_main.sei
generate:
-> system/user/tests/user_main.c
0 error(s), 0 warning(s)
sec 2.7.261-beta-080905
-  sec.properties
+  sec.plugins

<- system/user/tests/user_scenario.sei
generate:
-> system/user/tests/user_scenario.c
0 error(s), 0 warning(s)
sec 2.7.261-beta-080905
-  sec.properties
+  sec.plugins

<- system/host/host_media.sei
generate:
-> system/host/host_media.c
0 error(s), 0 warning(s)
sec 2.7.261-beta-080905
-  sec.properties
+  sec.plugins

<- system/host/host_model.sei
generate:
-> system/host/host_model.c
0 error(s), 0 warning(s)
sec 2.7.261-beta-080905
-  sec.properties
+  sec.plugins

<- system/host/tests/host_main.sei
generate:
-> system/host/tests/host_main.c
0 error(s), 0 warning(s)
sec 2.7.261-beta-080905
-  sec.properties
+  sec.plugins

<- system/host/tests/host_scenario.sei
generate:
-> system/host/tests/host_scenario.c
0 error(s), 0 warning(s)
sec 2.7.261-beta-080905
-  sec.properties
+  sec.plugins

<- system/stat/stat_media.sei
generate:
-> system/stat/stat_media.c
0 error(s), 0 warning(s)
sec 2.7.261-beta-080905
-  sec.properties
+  sec.plugins

<- system/stat/stat_model.sei
generate:
-> system/stat/stat_model.c
0 error(s), 0 warning(s)
sec 2.7.261-beta-080905
-  sec.properties
+  sec.plugins

<- system/stat/tests/stat_main.sei
generate:
-> system/stat/tests/stat_main.c
0 error(s), 0 warning(s)
sec 2.7.261-beta-080905
-  sec.properties
+  sec.plugins

<- system/stat/tests/stat_scenario.sei
generate:
-> system/stat/tests/stat_scenario.c
0 error(s), 0 warning(s)
sec 2.7.261-beta-080905
-  sec.properties
+  sec.plugins

<- util/assert/assert_media.sei
generate:
-> util/assert/assert_media.c
0 error(s), 0 warning(s)
sec 2.7.261-beta-080905
-  sec.properties
+  sec.plugins

<- util/assert/assert_model.sei
generate:
-> util/assert/assert_model.c
0 error(s), 0 warning(s)
sec 2.7.261-beta-080905
-  sec.properties
+  sec.plugins

<- util/assert/tests/assert_main.sei
generate:
-> util/assert/tests/assert_main.c
0 error(s), 0 warning(s)
sec 2.7.261-beta-080905
-  sec.properties
+  sec.plugins

<- util/assert/tests/assert_scenario.sei
generate:
-> util/assert/tests/assert_scenario.c
0 error(s), 0 warning(s)
sec 2.7.261-beta-080905
-  sec.properties
+  sec.plugins

<- util/bit/bit_media.sei
generate:
-> util/bit/bit_media.c
0 error(s), 0 warning(s)
sec 2.7.261-beta-080905
-  sec.properties
+  sec.plugins

<- util/bit/bit_model.sei
generate:
-> util/bit/bit_model.c
0 error(s), 0 warning(s)
sec 2.7.261-beta-080905
-  sec.properties
+  sec.plugins

<- util/bit/tests/bit_main.sei
generate:
-> util/bit/tests/bit_main.c
0 error(s), 0 warning(s)
sec 2.7.261-beta-080905
-  sec.properties
+  sec.plugins

<- util/bit/tests/bit_scenario.sei
generate:
-> util/bit/tests/bit_scenario.c
0 error(s), 0 warning(s)
sec 2.7.261-beta-080905
-  sec.properties
+  sec.plugins

<- util/compress/compress_media.sei
generate:
-> util/compress/compress_media.c
0 error(s), 0 warning(s)
sec 2.7.261-beta-080905
-  sec.properties
+  sec.plugins

<- util/compress/compress_model.sei
generate:
-> util/compress/compress_model.c
0 error(s), 0 warning(s)
sec 2.7.261-beta-080905
-  sec.properties
+  sec.plugins

<- util/compress/tests/compress_main.sei
generate:
-> util/compress/tests/compress_main.c
0 error(s), 0 warning(s)
sec 2.7.261-beta-080905
-  sec.properties
+  sec.plugins

<- util/compress/tests/compress_scenario.sei
generate:
-> util/compress/tests/compress_scenario.c
0 error(s), 0 warning(s)
sec 2.7.261-beta-080905
-  sec.properties
+  sec.plugins

<- util/conversion/strint_media.sei
generate:
-> util/conversion/strint_media.c
0 error(s), 0 warning(s)
sec 2.7.261-beta-080905
-  sec.properties
+  sec.plugins

<- util/conversion/strint_model.sei
generate:
-> util/conversion/strint_model.c
0 error(s), 0 warning(s)
sec 2.7.261-beta-080905
-  sec.properties
+  sec.plugins

<- util/conversion/strreal_media.sei
generate:
-> util/conversion/strreal_media.c
0 error(s), 0 warning(s)
sec 2.7.261-beta-080905
-  sec.properties
+  sec.plugins

<- util/conversion/strreal_model.sei
generate:
-> util/conversion/strreal_model.c
0 error(s), 0 warning(s)
sec 2.7.261-beta-080905
-  sec.properties
+  sec.plugins

<- util/conversion/token_media.sei
generate:
-> util/conversion/token_media.c
0 error(s), 0 warning(s)
sec 2.7.261-beta-080905
-  sec.properties
+  sec.plugins

<- util/conversion/token_model.sei
generate:
-> util/conversion/token_model.c
0 error(s), 0 warning(s)
sec 2.7.261-beta-080905
-  sec.properties
+  sec.plugins

<- util/conversion/util_conversion_common.sei
generate:
-> util/conversion/util_conversion_common.c
0 error(s), 0 warning(s)
sec 2.7.261-beta-080905
-  sec.properties
+  sec.plugins

<- util/conversion/wchar_media.sei
generate:
-> util/conversion/wchar_media.c
0 error(s), 0 warning(s)
sec 2.7.261-beta-080905
-  sec.properties
+  sec.plugins

<- util/conversion/wchar_model.sei
generate:
-> util/conversion/wchar_model.c
0 error(s), 0 warning(s)
sec 2.7.261-beta-080905
-  sec.properties
+  sec.plugins

<- util/conversion/wstrint_media.sei
generate:
-> util/conversion/wstrint_media.c
0 error(s), 0 warning(s)
sec 2.7.261-beta-080905
-  sec.properties
+  sec.plugins

<- util/conversion/wstrint_model.sei
generate:
-> util/conversion/wstrint_model.c
0 error(s), 0 warning(s)
sec 2.7.261-beta-080905
-  sec.properties
+  sec.plugins

<- util/conversion/wstrreal_media.sei
generate:
-> util/conversion/wstrreal_media.c
0 error(s), 0 warning(s)
sec 2.7.261-beta-080905
-  sec.properties
+  sec.plugins

<- util/conversion/wstrreal_model.sei
generate:
-> util/conversion/wstrreal_model.c
0 error(s), 0 warning(s)
sec 2.7.261-beta-080905
-  sec.properties
+  sec.plugins

<- util/conversion/wtoken_media.sei
generate:
-> util/conversion/wtoken_media.c
0 error(s), 0 warning(s)
sec 2.7.261-beta-080905
-  sec.properties
+  sec.plugins

<- util/conversion/wtoken_model.sei
generate:
-> util/conversion/wtoken_model.c
0 error(s), 0 warning(s)
sec 2.7.261-beta-080905
-  sec.properties
+  sec.plugins

<- util/conversion/tests/conversion_main.sei
generate:
-> util/conversion/tests/conversion_main.c
0 error(s), 0 warning(s)
sec 2.7.261-beta-080905
-  sec.properties
+  sec.plugins

<- util/conversion/tests/strint_scenario.sei
generate:
-> util/conversion/tests/strint_scenario.c
0 error(s), 0 warning(s)
sec 2.7.261-beta-080905
-  sec.properties
+  sec.plugins

<- util/conversion/tests/strreal_scenario.sei
generate:
-> util/conversion/tests/strreal_scenario.c
0 error(s), 0 warning(s)
sec 2.7.261-beta-080905
-  sec.properties
+  sec.plugins

<- util/conversion/tests/token_scenario.sei
generate:
-> util/conversion/tests/token_scenario.c
0 error(s), 0 warning(s)
sec 2.7.261-beta-080905
-  sec.properties
+  sec.plugins

<- util/conversion/tests/wchar_scenario.sei
generate:
-> util/conversion/tests/wchar_scenario.c
0 error(s), 0 warning(s)
sec 2.7.261-beta-080905
-  sec.properties
+  sec.plugins

<- util/conversion/tests/wstrint_scenario.sei
generate:
-> util/conversion/tests/wstrint_scenario.c
0 error(s), 0 warning(s)
sec 2.7.261-beta-080905
-  sec.properties
+  sec.plugins

<- util/conversion/tests/wstrreal_scenario.sei
generate:
-> util/conversion/tests/wstrreal_scenario.c
0 error(s), 0 warning(s)
sec 2.7.261-beta-080905
-  sec.properties
+  sec.plugins

<- util/conversion/tests/wtoken_scenario.sei
generate:
-> util/conversion/tests/wtoken_scenario.c
0 error(s), 0 warning(s)
sec 2.7.261-beta-080905
-  sec.properties
+  sec.plugins

<- util/crypt/crypt_media.sei
generate:
-> util/crypt/crypt_media.c
0 error(s), 0 warning(s)
sec 2.7.261-beta-080905
-  sec.properties
+  sec.plugins

<- util/crypt/crypt_model.sei
generate:
-> util/crypt/crypt_model.c
0 error(s), 0 warning(s)
sec 2.7.261-beta-080905
-  sec.properties
+  sec.plugins

<- util/crypt/tests/crypt_main.sei
generate:
-> util/crypt/tests/crypt_main.c
0 error(s), 0 warning(s)
sec 2.7.261-beta-080905
-  sec.properties
+  sec.plugins

<- util/crypt/tests/crypt_scenario.sei
generate:
-> util/crypt/tests/crypt_scenario.c
0 error(s), 0 warning(s)
sec 2.7.261-beta-080905
-  sec.properties
+  sec.plugins

<- util/dl/dl_media.sei
generate:
-> util/dl/dl_media.c
0 error(s), 0 warning(s)
sec 2.7.261-beta-080905
-  sec.properties
+  sec.plugins

<- util/dl/dl_model.sei
generate:
-> util/dl/dl_model.c
0 error(s), 0 warning(s)
sec 2.7.261-beta-080905
-  sec.properties
+  sec.plugins

<- util/dl/tests/dl_main.sei
generate:
-> util/dl/tests/dl_main.c
0 error(s), 0 warning(s)
sec 2.7.261-beta-080905
-  sec.properties
+  sec.plugins

<- util/dl/tests/dl_scenario.sei
generate:
-> util/dl/tests/dl_scenario.c
0 error(s), 0 warning(s)
sec 2.7.261-beta-080905
-  sec.properties
+  sec.plugins

<- util/dl/tests/dl_syms.sei
generate:
-> util/dl/tests/dl_syms.c
0 error(s), 0 warning(s)
sec 2.7.261-beta-080905
-  sec.properties
+  sec.plugins

<- util/float/float_media.sei
generate:
-> util/float/float_media.c
0 error(s), 0 warning(s)
sec 2.7.261-beta-080905
-  sec.properties
+  sec.plugins

<- util/float/float_model.sei
generate:
-> util/float/float_model.c
0 error(s), 0 warning(s)
sec 2.7.261-beta-080905
-  sec.properties
+  sec.plugins

<- util/float/tests/float_main.sei
generate:
-> util/float/tests/float_main.c
0 error(s), 0 warning(s)
sec 2.7.261-beta-080905
-  sec.properties
+  sec.plugins

<- util/float/tests/float_scenario.sei
generate:
-> util/float/tests/float_scenario.c
0 error(s), 0 warning(s)
sec 2.7.261-beta-080905
-  sec.properties
+  sec.plugins

<- util/format/fmtmsg_media.sei
generate:
-> util/format/fmtmsg_media.c
0 error(s), 0 warning(s)
sec 2.7.261-beta-080905
-  sec.properties
+  sec.plugins

<- util/format/fmtmsg_model.sei
generate:
-> util/format/fmtmsg_model.c
0 error(s), 0 warning(s)
sec 2.7.261-beta-080905
-  sec.properties
+  sec.plugins

<- util/format/money_media.sei
generate:
-> util/format/money_media.c
0 error(s), 0 warning(s)
sec 2.7.261-beta-080905
-  sec.properties
+  sec.plugins

<- util/format/money_model.sei
generate:
-> util/format/money_model.c
0 error(s), 0 warning(s)
sec 2.7.261-beta-080905
-  sec.properties
+  sec.plugins

<- util/format/printf_media.sei
generate:
-> util/format/printf_media.c
0 error(s), 0 warning(s)
sec 2.7.261-beta-080905
-  sec.properties
+  sec.plugins

<- util/format/printf_model.sei
generate:
-> util/format/printf_model.c
0 error(s), 0 warning(s)
sec 2.7.261-beta-080905
-  sec.properties
+  sec.plugins

<- util/format/scanf_media.sei
generate:
-> util/format/scanf_media.c
0 error(s), 0 warning(s)
sec 2.7.261-beta-080905
-  sec.properties
+  sec.plugins

<- util/format/scanf_model.sei
generate:
-> util/format/scanf_model.c
0 error(s), 0 warning(s)
sec 2.7.261-beta-080905
-  sec.properties
+  sec.plugins

<- util/format/time_media.sei
generate:
-> util/format/time_media.c
0 error(s), 0 warning(s)
sec 2.7.261-beta-080905
-  sec.properties
+  sec.plugins

<- util/format/time_model.sei
generate:
-> util/format/time_model.c
0 error(s), 0 warning(s)
sec 2.7.261-beta-080905
-  sec.properties
+  sec.plugins

<- util/format/wprintf_media.sei
generate:
-> util/format/wprintf_media.c
0 error(s), 0 warning(s)
sec 2.7.261-beta-080905
-  sec.properties
+  sec.plugins

<- util/format/wprintf_model.sei
generate:
-> util/format/wprintf_model.c
0 error(s), 0 warning(s)
sec 2.7.261-beta-080905
-  sec.properties
+  sec.plugins

<- util/format/wscanf_media.sei
generate:
-> util/format/wscanf_media.c
0 error(s), 0 warning(s)
sec 2.7.261-beta-080905
-  sec.properties
+  sec.plugins

<- util/format/wscanf_model.sei
generate:
-> util/format/wscanf_model.c
0 error(s), 0 warning(s)
sec 2.7.261-beta-080905
-  sec.properties
+  sec.plugins

<- util/format/wtime_media.sei
generate:
-> util/format/wtime_media.c
0 error(s), 0 warning(s)
sec 2.7.261-beta-080905
-  sec.properties
+  sec.plugins

<- util/format/wtime_model.sei
generate:
-> util/format/wtime_model.c
0 error(s), 0 warning(s)
sec 2.7.261-beta-080905
-  sec.properties
+  sec.plugins

<- util/format/tests/fmtmsg_scenario.sei
generate:
-> util/format/tests/fmtmsg_scenario.c
0 error(s), 0 warning(s)
sec 2.7.261-beta-080905
-  sec.properties
+  sec.plugins

<- util/format/tests/format_main.sei
generate:
-> util/format/tests/format_main.c
0 error(s), 0 warning(s)
sec 2.7.261-beta-080905
-  sec.properties
+  sec.plugins

<- util/format/tests/format_sheafs.sei
generate:
util/format/tests/format_sheafs.sec(37,5): warning: implicit declaration of function '__builtin_va_start'.
util/format/tests/format_sheafs.sec(39,5): warning: implicit declaration of function '__builtin_va_end'.
util/format/tests/format_sheafs.sec(48,5): warning: implicit declaration of function '__builtin_va_start'.
util/format/tests/format_sheafs.sec(50,5): warning: implicit declaration of function '__builtin_va_end'.
util/format/tests/format_sheafs.sec(60,5): warning: implicit declaration of function '__builtin_va_start'.
util/format/tests/format_sheafs.sec(66,5): warning: implicit declaration of function '__builtin_va_end'.
util/format/tests/format_sheafs.sec(76,5): warning: implicit declaration of function '__builtin_va_start'.
util/format/tests/format_sheafs.sec(82,5): warning: implicit declaration of function '__builtin_va_end'.
-> util/format/tests/format_sheafs.c
0 error(s), 8 warning(s)
sec 2.7.261-beta-080905
-  sec.properties
+  sec.plugins

<- util/format/tests/money_scenario.sei
generate:
-> util/format/tests/money_scenario.c
0 error(s), 0 warning(s)
sec 2.7.261-beta-080905
-  sec.properties
+  sec.plugins

<- util/format/tests/printf_scenario_data.sei
generate:
util/format/tests/printf_scenario_data.sec(28,47): warning: passing argument 3 of 'create_PrintedSheafAtom' makes integer from pointer without cast.
util/format/tests/printf_scenario_data.sec(29,47): warning: passing argument 3 of 'create_PrintedSheafAtom' makes integer from pointer without cast.
util/format/tests/printf_scenario_data.sec(30,47): warning: passing argument 3 of 'create_PrintedSheafAtom' makes integer from pointer without cast.
util/format/tests/printf_scenario_data.sec(31,47): warning: passing argument 3 of 'create_PrintedSheafAtom' makes integer from pointer without cast.
util/format/tests/printf_scenario_data.sec(32,47): warning: passing argument 3 of 'create_PrintedSheafAtom' makes integer from pointer without cast.
util/format/tests/printf_scenario_data.sec(33,47): warning: passing argument 3 of 'create_PrintedSheafAtom' makes integer from pointer without cast.
util/format/tests/printf_scenario_data.sec(34,47): warning: passing argument 3 of 'create_PrintedSheafAtom' makes integer from pointer without cast.
util/format/tests/printf_scenario_data.sec(35,47): warning: passing argument 3 of 'create_PrintedSheafAtom' makes integer from pointer without cast.
-> util/format/tests/printf_scenario_data.c
0 error(s), 8 warning(s)
sec 2.7.261-beta-080905
-  sec.properties
+  sec.plugins

<- util/format/tests/printf_scenario.sei
generate:
-> util/format/tests/printf_scenario.c
0 error(s), 0 warning(s)
sec 2.7.261-beta-080905
-  sec.properties
+  sec.plugins

<- util/format/tests/scanf_scenario_data.sei
generate:
util/format/tests/scanf_scenario_data.sec(522,5): warning: implicit declaration of function '__builtin_va_start'.
util/format/tests/scanf_scenario_data.sec(525,5): warning: implicit declaration of function '__builtin_va_end'.
-> util/format/tests/scanf_scenario_data.c
0 error(s), 2 warning(s)
sec 2.7.261-beta-080905
-  sec.properties
+  sec.plugins

<- util/format/tests/scanf_scenario.sei
generate:
-> util/format/tests/scanf_scenario.c
0 error(s), 0 warning(s)
sec 2.7.261-beta-080905
-  sec.properties
+  sec.plugins

<- util/format/tests/time_scenario.sei
generate:
-> util/format/tests/time_scenario.c
0 error(s), 0 warning(s)
sec 2.7.261-beta-080905
-  sec.properties
+  sec.plugins

<- util/format/tests/wprintf_scenario_data.sei
generate:
util/format/tests/wprintf_scenario_data.sec(30,48): warning: passing argument 3 of 'create_WprintedSheafAtom' makes integer from pointer without cast.
util/format/tests/wprintf_scenario_data.sec(31,48): warning: passing argument 3 of 'create_WprintedSheafAtom' makes integer from pointer without cast.
util/format/tests/wprintf_scenario_data.sec(32,48): warning: passing argument 3 of 'create_WprintedSheafAtom' makes integer from pointer without cast.
util/format/tests/wprintf_scenario_data.sec(33,48): warning: passing argument 3 of 'create_WprintedSheafAtom' makes integer from pointer without cast.
util/format/tests/wprintf_scenario_data.sec(34,48): warning: passing argument 3 of 'create_WprintedSheafAtom' makes integer from pointer without cast.
util/format/tests/wprintf_scenario_data.sec(35,48): warning: passing argument 3 of 'create_WprintedSheafAtom' makes integer from pointer without cast.
util/format/tests/wprintf_scenario_data.sec(36,48): warning: passing argument 3 of 'create_WprintedSheafAtom' makes integer from pointer without cast.
util/format/tests/wprintf_scenario_data.sec(37,48): warning: passing argument 3 of 'create_WprintedSheafAtom' makes integer from pointer without cast.
util/format/tests/wprintf_scenario_data.sec(4012,5): warning: implicit declaration of function '__builtin_va_start'.
util/format/tests/wprintf_scenario_data.sec(4015,5): warning: implicit declaration of function '__builtin_va_end'.
-> util/format/tests/wprintf_scenario_data.c
0 error(s), 10 warning(s)
sec 2.7.261-beta-080905
-  sec.properties
+  sec.plugins

<- util/format/tests/wprintf_scenario.sei
generate:
-> util/format/tests/wprintf_scenario.c
0 error(s), 0 warning(s)
sec 2.7.261-beta-080905
-  sec.properties
+  sec.plugins

<- util/format/tests/wscanf_scenario_data.sei
generate:
util/format/tests/wscanf_scenario_data.sec(522,5): warning: implicit declaration of function '__builtin_va_start'.
util/format/tests/wscanf_scenario_data.sec(525,5): warning: implicit declaration of function '__builtin_va_end'.
-> util/format/tests/wscanf_scenario_data.c
0 error(s), 2 warning(s)
sec 2.7.261-beta-080905
-  sec.properties
+  sec.plugins

<- util/format/tests/wscanf_scenario.sei
generate:
-> util/format/tests/wscanf_scenario.c
0 error(s), 0 warning(s)
sec 2.7.261-beta-080905
-  sec.properties
+  sec.plugins

<- util/format/tests/wtime_scenario.sei
generate:
-> util/format/tests/wtime_scenario.c
0 error(s), 0 warning(s)
sec 2.7.261-beta-080905
-  sec.properties
+  sec.plugins

<- util/getopt/getopt_media.sei
generate:
-> util/getopt/getopt_media.c
0 error(s), 0 warning(s)
sec 2.7.261-beta-080905
-  sec.properties
+  sec.plugins

<- util/getopt/getopt_model.sei
generate:
-> util/getopt/getopt_model.c
0 error(s), 0 warning(s)
sec 2.7.261-beta-080905
-  sec.properties
+  sec.plugins

<- util/getopt/getopt.sei
generate:
-> util/getopt/getopt.c
0 error(s), 0 warning(s)
sec 2.7.261-beta-080905
-  sec.properties
+  sec.plugins

<- util/getopt/tests/getopt_main.sei
generate:
-> util/getopt/tests/getopt_main.c
0 error(s), 0 warning(s)
sec 2.7.261-beta-080905
-  sec.properties
+  sec.plugins

<- util/getopt/tests/getopt_scenario.sei
generate:
-> util/getopt/tests/getopt_scenario.c
0 error(s), 0 warning(s)
sec 2.7.261-beta-080905
-  sec.properties
+  sec.plugins

<- util/inet/inet_media.sei
generate:
-> util/inet/inet_media.c
0 error(s), 0 warning(s)
sec 2.7.261-beta-080905
-  sec.properties
+  sec.plugins

<- util/inet/inet_model.sei
generate:
-> util/inet/inet_model.c
0 error(s), 0 warning(s)
sec 2.7.261-beta-080905
-  sec.properties
+  sec.plugins

<- util/inet/tests/inet_main.sei
generate:
-> util/inet/tests/inet_main.c
0 error(s), 0 warning(s)
sec 2.7.261-beta-080905
-  sec.properties
+  sec.plugins

<- util/inet/tests/inet_scenario.sei
generate:
-> util/inet/tests/inet_scenario.c
0 error(s), 0 warning(s)
sec 2.7.261-beta-080905
-  sec.properties
+  sec.plugins

<- util/pam/pam_media.sei
generate:
-> util/pam/pam_media.c
0 error(s), 0 warning(s)
sec 2.7.261-beta-080905
-  sec.properties
+  sec.plugins

<- util/pam/pam_model.sei
generate:
-> util/pam/pam_model.c
0 error(s), 0 warning(s)
sec 2.7.261-beta-080905
-  sec.properties
+  sec.plugins

<- util/pam/tests/pam_main.sei
generate:
-> util/pam/tests/pam_main.c
0 error(s), 0 warning(s)
sec 2.7.261-beta-080905
-  sec.properties
+  sec.plugins

<- util/pam/tests/pam_scenario.sei
generate:
-> util/pam/tests/pam_scenario.c
0 error(s), 0 warning(s)
sec 2.7.261-beta-080905
-  sec.properties
+  sec.plugins

<- util/regex/regex_media.sei
generate:
-> util/regex/regex_media.c
0 error(s), 0 warning(s)
sec 2.7.261-beta-080905
-  sec.properties
+  sec.plugins

<- util/regex/regex_model.sei
generate:
util/regex/regex_model.sec(1384,5): warning: implicit declaration of function '__builtin_va_start'.
util/regex/regex_model.sec(1386,5): warning: implicit declaration of function '__builtin_va_end'.
util/regex/regex_model.sec(1421,5): warning: implicit declaration of function '__builtin_va_start'.
util/regex/regex_model.sec(1424,5): warning: implicit declaration of function '__builtin_va_end'.
-> util/regex/regex_model.c
0 error(s), 4 warning(s)
sec 2.7.261-beta-080905
-  sec.properties
+  sec.plugins

<- util/regex/tests/regex_main.sei
generate:
-> util/regex/tests/regex_main.c
0 error(s), 0 warning(s)
sec 2.7.261-beta-080905
-  sec.properties
+  sec.plugins

<- util/regex/tests/regex_scenario.sei
generate:
-> util/regex/tests/regex_scenario.c
0 error(s), 0 warning(s)
sec 2.7.261-beta-080905
-  sec.properties
+  sec.plugins

<- util/search/hash_media.sei
generate:
-> util/search/hash_media.c
0 error(s), 0 warning(s)
sec 2.7.261-beta-080905
-  sec.properties
+  sec.plugins

<- util/search/hash_model.sei
generate:
-> util/search/hash_model.c
0 error(s), 0 warning(s)
sec 2.7.261-beta-080905
-  sec.properties
+  sec.plugins

<- util/search/queue_media.sei
generate:
-> util/search/queue_media.c
0 error(s), 0 warning(s)
sec 2.7.261-beta-080905
-  sec.properties
+  sec.plugins

<- util/search/queue_model.sei
generate:
-> util/search/queue_model.c
0 error(s), 0 warning(s)
sec 2.7.261-beta-080905
-  sec.properties
+  sec.plugins

<- util/search/search_media.sei
generate:
-> util/search/search_media.c
0 error(s), 0 warning(s)
sec 2.7.261-beta-080905
-  sec.properties
+  sec.plugins

<- util/search/search_model.sei
generate:
-> util/search/search_model.c
0 error(s), 0 warning(s)
sec 2.7.261-beta-080905
-  sec.properties
+  sec.plugins

<- util/search/tree_media.sei
generate:
-> util/search/tree_media.c
0 error(s), 0 warning(s)
sec 2.7.261-beta-080905
-  sec.properties
+  sec.plugins

<- util/search/tree_model.sei
generate:
-> util/search/tree_model.c
0 error(s), 0 warning(s)
sec 2.7.261-beta-080905
-  sec.properties
+  sec.plugins

<- util/search/tests/hash_scenario.sei
generate:
-> util/search/tests/hash_scenario.c
0 error(s), 0 warning(s)
sec 2.7.261-beta-080905
-  sec.properties
+  sec.plugins

<- util/search/tests/queue_scenario.sei
generate:
-> util/search/tests/queue_scenario.c
0 error(s), 0 warning(s)
sec 2.7.261-beta-080905
-  sec.properties
+  sec.plugins

<- util/search/tests/search_main.sei
generate:
-> util/search/tests/search_main.c
0 error(s), 0 warning(s)
sec 2.7.261-beta-080905
-  sec.properties
+  sec.plugins

<- util/search/tests/search_scenario.sei
generate:
-> util/search/tests/search_scenario.c
0 error(s), 0 warning(s)
sec 2.7.261-beta-080905
-  sec.properties
+  sec.plugins

<- util/search/tests/tree_scenario.sei
generate:
-> util/search/tests/tree_scenario.c
0 error(s), 0 warning(s)
sec 2.7.261-beta-080905
-  sec.properties
+  sec.plugins

<- util/string/casecmp_media.sei
generate:
-> util/string/casecmp_media.c
0 error(s), 0 warning(s)
sec 2.7.261-beta-080905
-  sec.properties
+  sec.plugins

<- util/string/casecmp_model.sei
generate:
-> util/string/casecmp_model.c
0 error(s), 0 warning(s)
sec 2.7.261-beta-080905
-  sec.properties
+  sec.plugins

<- util/string/mem_media.sei
generate:
-> util/string/mem_media.c
0 error(s), 0 warning(s)
sec 2.7.261-beta-080905
-  sec.properties
+  sec.plugins

<- util/string/mem_model.sei
generate:
-> util/string/mem_model.c
0 error(s), 0 warning(s)
sec 2.7.261-beta-080905
-  sec.properties
+  sec.plugins

<- util/string/str_media.sei
generate:
-> util/string/str_media.c
0 error(s), 0 warning(s)
sec 2.7.261-beta-080905
-  sec.properties
+  sec.plugins

<- util/string/str_model.sei
generate:
-> util/string/str_model.c
0 error(s), 0 warning(s)
sec 2.7.261-beta-080905
-  sec.properties
+  sec.plugins

<- util/string/wcasecmp_media.sei
generate:
-> util/string/wcasecmp_media.c
0 error(s), 0 warning(s)
sec 2.7.261-beta-080905
-  sec.properties
+  sec.plugins

<- util/string/wcasecmp_model.sei
generate:
-> util/string/wcasecmp_model.c
0 error(s), 0 warning(s)
sec 2.7.261-beta-080905
-  sec.properties
+  sec.plugins

<- util/string/wmem_media.sei
generate:
-> util/string/wmem_media.c
0 error(s), 0 warning(s)
sec 2.7.261-beta-080905
-  sec.properties
+  sec.plugins

<- util/string/wmem_model.sei
generate:
-> util/string/wmem_model.c
0 error(s), 0 warning(s)
sec 2.7.261-beta-080905
-  sec.properties
+  sec.plugins

<- util/string/wstr_media.sei
generate:
-> util/string/wstr_media.c
0 error(s), 0 warning(s)
sec 2.7.261-beta-080905
-  sec.properties
+  sec.plugins

<- util/string/wstr_model.sei
generate:
-> util/string/wstr_model.c
0 error(s), 0 warning(s)
sec 2.7.261-beta-080905
-  sec.properties
+  sec.plugins

<- util/string/tests/casecmp_scenario.sei
generate:
-> util/string/tests/casecmp_scenario.c
0 error(s), 0 warning(s)
sec 2.7.261-beta-080905
-  sec.properties
+  sec.plugins

<- util/string/tests/mem_scenario.sei
generate:
-> util/string/tests/mem_scenario.c
0 error(s), 0 warning(s)
sec 2.7.261-beta-080905
-  sec.properties
+  sec.plugins

<- util/string/tests/string_main.sei
generate:
-> util/string/tests/string_main.c
0 error(s), 0 warning(s)
sec 2.7.261-beta-080905
-  sec.properties
+  sec.plugins

<- util/string/tests/str_scenario.sei
generate:
-> util/string/tests/str_scenario.c
0 error(s), 0 warning(s)
sec 2.7.261-beta-080905
-  sec.properties
+  sec.plugins

<- util/string/tests/wcasecmp_scenario.sei
generate:
-> util/string/tests/wcasecmp_scenario.c
0 error(s), 0 warning(s)
sec 2.7.261-beta-080905
-  sec.properties
+  sec.plugins

<- util/string/tests/wmem_scenario.sei
generate:
-> util/string/tests/wmem_scenario.c
0 error(s), 0 warning(s)
sec 2.7.261-beta-080905
-  sec.properties
+  sec.plugins

<- util/string/tests/wstr_scenario.sei
generate:
-> util/string/tests/wstr_scenario.c
0 error(s), 0 warning(s)
sec 2.7.261-beta-080905
-  sec.properties
+  sec.plugins

<- util/wordexp/wordexp_media.sei
generate:
-> util/wordexp/wordexp_media.c
0 error(s), 0 warning(s)
sec 2.7.261-beta-080905
-  sec.properties
+  sec.plugins

<- util/wordexp/wordexp_model.sei
generate:
-> util/wordexp/wordexp_model.c
0 error(s), 0 warning(s)
sec 2.7.261-beta-080905
-  sec.properties
+  sec.plugins

<- util/wordexp/tests/wordexp_main.sei
generate:
-> util/wordexp/tests/wordexp_main.c
0 error(s), 0 warning(s)
sec 2.7.261-beta-080905
-  sec.properties
+  sec.plugins

<- util/wordexp/tests/wordexp_scenario.sei
generate:
-> util/wordexp/tests/wordexp_scenario.c
0 error(s), 0 warning(s)
sec 2.7.261-beta-080905
-  sec.properties
+  sec.plugins

<- math/bessel/bessel_media.sei
generate:
-> math/bessel/bessel_media.c
0 error(s), 0 warning(s)
sec 2.7.261-beta-080905
-  sec.properties
+  sec.plugins

<- math/bessel/bessel_model.sei
generate:
-> math/bessel/bessel_model.c
0 error(s), 0 warning(s)
sec 2.7.261-beta-080905
-  sec.properties
+  sec.plugins

<- math/bessel/tests/bessel_main.sei
generate:
-> math/bessel/tests/bessel_main.c
0 error(s), 0 warning(s)
sec 2.7.261-beta-080905
-  sec.properties
+  sec.plugins

<- math/bessel/tests/bessel_scenario.sei
generate:
-> math/bessel/tests/bessel_scenario.c
0 error(s), 0 warning(s)
sec 2.7.261-beta-080905
-  sec.properties
+  sec.plugins

<- math/cexp/cexp_media.sei
generate:
-> math/cexp/cexp_media.c
0 error(s), 0 warning(s)
sec 2.7.261-beta-080905
-  sec.properties
+  sec.plugins

<- math/cexp/cexp_model.sei
generate:
-> math/cexp/cexp_model.c
0 error(s), 0 warning(s)
sec 2.7.261-beta-080905
-  sec.properties
+  sec.plugins

<- math/cexp/tests/cexp_main.sei
generate:
-> math/cexp/tests/cexp_main.c
0 error(s), 0 warning(s)
sec 2.7.261-beta-080905
-  sec.properties
+  sec.plugins

<- math/cexp/tests/cexp_scenario.sei
generate:
-> math/cexp/tests/cexp_scenario.c
0 error(s), 0 warning(s)
sec 2.7.261-beta-080905
-  sec.properties
+  sec.plugins

<- math/chyper/chyper_media.sei
generate:
-> math/chyper/chyper_media.c
0 error(s), 0 warning(s)
sec 2.7.261-beta-080905
-  sec.properties
+  sec.plugins

<- math/chyper/chyper_model.sei
generate:
-> math/chyper/chyper_model.c
0 error(s), 0 warning(s)
sec 2.7.261-beta-080905
-  sec.properties
+  sec.plugins

<- math/chyper/tests/chyper_main.sei
generate:
-> math/chyper/tests/chyper_main.c
0 error(s), 0 warning(s)
sec 2.7.261-beta-080905
-  sec.properties
+  sec.plugins

<- math/chyper/tests/chyper_scenario.sei
generate:
-> math/chyper/tests/chyper_scenario.c
0 error(s), 0 warning(s)
sec 2.7.261-beta-080905
-  sec.properties
+  sec.plugins

<- math/complex/complex_media.sei
generate:
-> math/complex/complex_media.c
0 error(s), 0 warning(s)
sec 2.7.261-beta-080905
-  sec.properties
+  sec.plugins

<- math/complex/complex_model.sei
generate:
-> math/complex/complex_model.c
0 error(s), 0 warning(s)
sec 2.7.261-beta-080905
-  sec.properties
+  sec.plugins

<- math/complex/tests/complex_main.sei
generate:
-> math/complex/tests/complex_main.c
0 error(s), 0 warning(s)
sec 2.7.261-beta-080905
-  sec.properties
+  sec.plugins

<- math/complex/tests/complex_scenario.sei
generate:
-> math/complex/tests/complex_scenario.c
0 error(s), 0 warning(s)
sec 2.7.261-beta-080905
-  sec.properties
+  sec.plugins

<- math/ctrig/ctrig_media.sei
generate:
-> math/ctrig/ctrig_media.c
0 error(s), 0 warning(s)
sec 2.7.261-beta-080905
-  sec.properties
+  sec.plugins

<- math/ctrig/ctrig_model.sei
generate:
-> math/ctrig/ctrig_model.c
0 error(s), 0 warning(s)
sec 2.7.261-beta-080905
-  sec.properties
+  sec.plugins

<- math/ctrig/tests/ctrig_main.sei
generate:
-> math/ctrig/tests/ctrig_main.c
0 error(s), 0 warning(s)
sec 2.7.261-beta-080905
-  sec.properties
+  sec.plugins

<- math/ctrig/tests/ctrig_scenario.sei
generate:
-> math/ctrig/tests/ctrig_scenario.c
0 error(s), 0 warning(s)
sec 2.7.261-beta-080905
-  sec.properties
+  sec.plugins

<- math/error/error_media.sei
generate:
-> math/error/error_media.c
0 error(s), 0 warning(s)
sec 2.7.261-beta-080905
-  sec.properties
+  sec.plugins

<- math/error/error_model.sei
generate:
-> math/error/error_model.c
0 error(s), 0 warning(s)
sec 2.7.261-beta-080905
-  sec.properties
+  sec.plugins

<- math/error/tests/error_main.sei
generate:
-> math/error/tests/error_main.c
0 error(s), 0 warning(s)
sec 2.7.261-beta-080905
-  sec.properties
+  sec.plugins

<- math/error/tests/error_scenario.sei
generate:
-> math/error/tests/error_scenario.c
0 error(s), 0 warning(s)
sec 2.7.261-beta-080905
-  sec.properties
+  sec.plugins

<- math/exp/exp_media.sei
generate:
-> math/exp/exp_media.c
0 error(s), 0 warning(s)
sec 2.7.261-beta-080905
-  sec.properties
+  sec.plugins

<- math/exp/exp_model.sei
generate:
-> math/exp/exp_model.c
0 error(s), 0 warning(s)
sec 2.7.261-beta-080905
-  sec.properties
+  sec.plugins

<- math/exp/tests/exp_main.sei
generate:
-> math/exp/tests/exp_main.c
0 error(s), 0 warning(s)
sec 2.7.261-beta-080905
-  sec.properties
+  sec.plugins

<- math/exp/tests/exp_scenario.sei
generate:
-> math/exp/tests/exp_scenario.c
0 error(s), 0 warning(s)
sec 2.7.261-beta-080905
-  sec.properties
+  sec.plugins

<- math/gamma/gamma_media.sei
generate:
-> math/gamma/gamma_media.c
0 error(s), 0 warning(s)
sec 2.7.261-beta-080905
-  sec.properties
+  sec.plugins

<- math/gamma/gamma_model.sei
generate:
-> math/gamma/gamma_model.c
0 error(s), 0 warning(s)
sec 2.7.261-beta-080905
-  sec.properties
+  sec.plugins

<- math/gamma/tests/gamma_main.sei
generate:
-> math/gamma/tests/gamma_main.c
0 error(s), 0 warning(s)
sec 2.7.261-beta-080905
-  sec.properties
+  sec.plugins

<- math/gamma/tests/gamma_scenario.sei
generate:
-> math/gamma/tests/gamma_scenario.c
0 error(s), 0 warning(s)
sec 2.7.261-beta-080905
-  sec.properties
+  sec.plugins

<- math/hyper/hyper_media.sei
generate:
-> math/hyper/hyper_media.c
0 error(s), 0 warning(s)
sec 2.7.261-beta-080905
-  sec.properties
+  sec.plugins

<- math/hyper/hyper_model.sei
generate:
-> math/hyper/hyper_model.c
0 error(s), 0 warning(s)
sec 2.7.261-beta-080905
-  sec.properties
+  sec.plugins

<- math/hyper/tests/hyper_main.sei
generate:
-> math/hyper/tests/hyper_main.c
0 error(s), 0 warning(s)
sec 2.7.261-beta-080905
-  sec.properties
+  sec.plugins

<- math/hyper/tests/hyper_scenario.sei
generate:
-> math/hyper/tests/hyper_scenario.c
0 error(s), 0 warning(s)
sec 2.7.261-beta-080905
-  sec.properties
+  sec.plugins

<- math/integer/integer_media.sei
generate:
-> math/integer/integer_media.c
0 error(s), 0 warning(s)
sec 2.7.261-beta-080905
-  sec.properties
+  sec.plugins

<- math/integer/integer_model.sei
generate:
-> math/integer/integer_model.c
0 error(s), 0 warning(s)
sec 2.7.261-beta-080905
-  sec.properties
+  sec.plugins

<- math/integer/tests/integer_main.sei
generate:
-> math/integer/tests/integer_main.c
0 error(s), 0 warning(s)
sec 2.7.261-beta-080905
-  sec.properties
+  sec.plugins

<- math/integer/tests/integer_scenario.sei
generate:
-> math/integer/tests/integer_scenario.c
0 error(s), 0 warning(s)
sec 2.7.261-beta-080905
-  sec.properties
+  sec.plugins

<- math/math/math_data.sei
generate:
-> math/math/math_data.c
0 error(s), 0 warning(s)
sec 2.7.261-beta-080905
-  sec.properties
+  sec.plugins

<- math/rand/rand_media.sei
generate:
-> math/rand/rand_media.c
0 error(s), 0 warning(s)
sec 2.7.261-beta-080905
-  sec.properties
+  sec.plugins

<- math/rand/rand_model.sei
generate:
-> math/rand/rand_model.c
0 error(s), 0 warning(s)
sec 2.7.261-beta-080905
-  sec.properties
+  sec.plugins

<- math/rand/tests/rand_main.sei
generate:
-> math/rand/tests/rand_main.c
0 error(s), 0 warning(s)
sec 2.7.261-beta-080905
-  sec.properties
+  sec.plugins

<- math/rand/tests/rand_scenario.sei
generate:
-> math/rand/tests/rand_scenario.c
0 error(s), 0 warning(s)
sec 2.7.261-beta-080905
-  sec.properties
+  sec.plugins

<- math/real/real_media.sei
generate:
-> math/real/real_media.c
0 error(s), 0 warning(s)
sec 2.7.261-beta-080905
-  sec.properties
+  sec.plugins

<- math/real/real_model.sei
generate:
-> math/real/real_model.c
0 error(s), 0 warning(s)
sec 2.7.261-beta-080905
-  sec.properties
+  sec.plugins

<- math/real/tests/real_main.sei
generate:
-> math/real/tests/real_main.c
0 error(s), 0 warning(s)
sec 2.7.261-beta-080905
-  sec.properties
+  sec.plugins

<- math/real/tests/real_scenario.sei
generate:
-> math/real/tests/real_scenario.c
0 error(s), 0 warning(s)
sec 2.7.261-beta-080905
-  sec.properties
+  sec.plugins

<- math/trig/trig_media.sei
generate:
-> math/trig/trig_media.c
0 error(s), 0 warning(s)
sec 2.7.261-beta-080905
-  sec.properties
+  sec.plugins

<- math/trig/trig_model.sei
generate:
-> math/trig/trig_model.c
0 error(s), 0 warning(s)
sec 2.7.261-beta-080905
-  sec.properties
+  sec.plugins

<- math/trig/tests/trig_main.sei
generate:
-> math/trig/tests/trig_main.c
0 error(s), 0 warning(s)
sec 2.7.261-beta-080905
-  sec.properties
+  sec.plugins

<- math/trig/tests/trig_scenario.sei
generate:
-> math/trig/tests/trig_scenario.c
0 error(s), 0 warning(s)
sec 2.7.261-beta-080905
-  sec.properties
+  sec.plugins

<- locale/collate/collate_media.sei
generate:
-> locale/collate/collate_media.c
0 error(s), 0 warning(s)
sec 2.7.261-beta-080905
-  sec.properties
+  sec.plugins

<- locale/collate/collate_model.sei
generate:
-> locale/collate/collate_model.c
0 error(s), 0 warning(s)
sec 2.7.261-beta-080905
-  sec.properties
+  sec.plugins

<- locale/collate/tests/collate_main.sei
generate:
-> locale/collate/tests/collate_main.c
0 error(s), 0 warning(s)
sec 2.7.261-beta-080905
-  sec.properties
+  sec.plugins

<- locale/collate/tests/collate_scenario.sei
generate:
-> locale/collate/tests/collate_scenario.c
0 error(s), 0 warning(s)
sec 2.7.261-beta-080905
-  sec.properties
+  sec.plugins

<- locale/ctrans/ctrans_media.sei
generate:
-> locale/ctrans/ctrans_media.c
0 error(s), 0 warning(s)
sec 2.7.261-beta-080905
-  sec.properties
+  sec.plugins

<- locale/ctrans/ctrans_model.sei
generate:
-> locale/ctrans/ctrans_model.c
0 error(s), 0 warning(s)
sec 2.7.261-beta-080905
-  sec.properties
+  sec.plugins

<- locale/ctrans/tests/ctrans_main.sei
generate:
-> locale/ctrans/tests/ctrans_main.c
0 error(s), 0 warning(s)
sec 2.7.261-beta-080905
-  sec.properties
+  sec.plugins

<- locale/ctrans/tests/ctrans_scenario.sei
generate:
-> locale/ctrans/tests/ctrans_scenario.c
0 error(s), 0 warning(s)
sec 2.7.261-beta-080905
-  sec.properties
+  sec.plugins

<- locale/ctype/ctype_media.sei
generate:
-> locale/ctype/ctype_media.c
0 error(s), 0 warning(s)
sec 2.7.261-beta-080905
-  sec.properties
+  sec.plugins

<- locale/ctype/ctype_model.sei
generate:
-> locale/ctype/ctype_model.c
0 error(s), 0 warning(s)
sec 2.7.261-beta-080905
-  sec.properties
+  sec.plugins

<- locale/ctype/tests/ctype_main.sei
generate:
-> locale/ctype/tests/ctype_main.c
0 error(s), 0 warning(s)
sec 2.7.261-beta-080905
-  sec.properties
+  sec.plugins

<- locale/ctype/tests/ctype_scenario.sei
generate:
-> locale/ctype/tests/ctype_scenario.c
0 error(s), 0 warning(s)
sec 2.7.261-beta-080905
-  sec.properties
+  sec.plugins

<- locale/iconv/iconv_media.sei
generate:
-> locale/iconv/iconv_media.c
0 error(s), 0 warning(s)
sec 2.7.261-beta-080905
-  sec.properties
+  sec.plugins

<- locale/iconv/iconv_model.sei
generate:
-> locale/iconv/iconv_model.c
0 error(s), 0 warning(s)
sec 2.7.261-beta-080905
-  sec.properties
+  sec.plugins

<- locale/iconv/tests/iconv_main.sei
generate:
-> locale/iconv/tests/iconv_main.c
0 error(s), 0 warning(s)
sec 2.7.261-beta-080905
-  sec.properties
+  sec.plugins

<- locale/iconv/tests/iconv_scenario.sei
generate:
-> locale/iconv/tests/iconv_scenario.c
0 error(s), 0 warning(s)
sec 2.7.261-beta-080905
-  sec.properties
+  sec.plugins

<- locale/locale/locale_media.sei
generate:
-> locale/locale/locale_media.c
0 error(s), 0 warning(s)
sec 2.7.261-beta-080905
-  sec.properties
+  sec.plugins

<- locale/locale/locale_model.sei
generate:
-> locale/locale/locale_model.c
0 error(s), 0 warning(s)
sec 2.7.261-beta-080905
-  sec.properties
+  sec.plugins

<- locale/locale/tests/locale_main.sei
generate:
-> locale/locale/tests/locale_main.c
0 error(s), 0 warning(s)
sec 2.7.261-beta-080905
-  sec.properties
+  sec.plugins

<- locale/locale/tests/locale_scenario.sei
generate:
-> locale/locale/tests/locale_scenario.c
0 error(s), 0 warning(s)
sec 2.7.261-beta-080905
-  sec.properties
+  sec.plugins

<- locale/messages/messages_media.sei
generate:
-> locale/messages/messages_media.c
0 error(s), 0 warning(s)
sec 2.7.261-beta-080905
-  sec.properties
+  sec.plugins

<- locale/messages/messages_model.sei
generate:
-> locale/messages/messages_model.c
0 error(s), 0 warning(s)
sec 2.7.261-beta-080905
-  sec.properties
+  sec.plugins

<- locale/messages/tests/messages_main.sei
generate:
-> locale/messages/tests/messages_main.c
0 error(s), 0 warning(s)
sec 2.7.261-beta-080905
-  sec.properties
+  sec.plugins

<- locale/messages/tests/messages_scenario.sei
generate:
-> locale/messages/tests/messages_scenario.c
0 error(s), 0 warning(s)
sec 2.7.261-beta-080905
-  sec.properties
+  sec.plugins

<- locale/nlcat/nlcat_media.sei
generate:
-> locale/nlcat/nlcat_media.c
0 error(s), 0 warning(s)
sec 2.7.261-beta-080905
-  sec.properties
+  sec.plugins

<- locale/nlcat/nlcat_model.sei
generate:
-> locale/nlcat/nlcat_model.c
0 error(s), 0 warning(s)
sec 2.7.261-beta-080905
-  sec.properties
+  sec.plugins

<- locale/nlcat/tests/nlcat_main.sei
generate:
-> locale/nlcat/tests/nlcat_main.c
0 error(s), 0 warning(s)
sec 2.7.261-beta-080905
-  sec.properties
+  sec.plugins

<- locale/nlcat/tests/nlcat_scenario.sei
generate:
-> locale/nlcat/tests/nlcat_scenario.c
0 error(s), 0 warning(s)
sec 2.7.261-beta-080905
-  sec.properties
+  sec.plugins

<- locale/textdomain/textdomain_media.sei
generate:
-> locale/textdomain/textdomain_media.c
0 error(s), 0 warning(s)
sec 2.7.261-beta-080905
-  sec.properties
+  sec.plugins

<- locale/textdomain/textdomain_model.sei
generate:
-> locale/textdomain/textdomain_model.c
0 error(s), 0 warning(s)
sec 2.7.261-beta-080905
-  sec.properties
+  sec.plugins

<- locale/textdomain/tests/textdomain_main.sei
generate:
-> locale/textdomain/tests/textdomain_main.c
0 error(s), 0 warning(s)
sec 2.7.261-beta-080905
-  sec.properties
+  sec.plugins

<- locale/textdomain/tests/textdomain_scenario.sei
generate:
-> locale/textdomain/tests/textdomain_scenario.c
0 error(s), 0 warning(s)
sec 2.7.261-beta-080905
-  sec.properties
+  sec.plugins

<- locale/wcollate/wcollate_media.sei
generate:
-> locale/wcollate/wcollate_media.c
0 error(s), 0 warning(s)
sec 2.7.261-beta-080905
-  sec.properties
+  sec.plugins

<- locale/wcollate/wcollate_model.sei
generate:
-> locale/wcollate/wcollate_model.c
0 error(s), 0 warning(s)
sec 2.7.261-beta-080905
-  sec.properties
+  sec.plugins

<- locale/wcollate/tests/wcollate_main.sei
generate:
-> locale/wcollate/tests/wcollate_main.c
0 error(s), 0 warning(s)
sec 2.7.261-beta-080905
-  sec.properties
+  sec.plugins

<- locale/wcollate/tests/wcollate_scenario.sei
generate:
-> locale/wcollate/tests/wcollate_scenario.c
0 error(s), 0 warning(s)
sec 2.7.261-beta-080905
-  sec.properties
+  sec.plugins

<- locale/wctrans/wctrans_media.sei
generate:
-> locale/wctrans/wctrans_media.c
0 error(s), 0 warning(s)
sec 2.7.261-beta-080905
-  sec.properties
+  sec.plugins

<- locale/wctrans/wctrans_model.sei
generate:
-> locale/wctrans/wctrans_model.c
0 error(s), 0 warning(s)
sec 2.7.261-beta-080905
-  sec.properties
+  sec.plugins

<- locale/wctrans/tests/wctrans_main.sei
generate:
-> locale/wctrans/tests/wctrans_main.c
0 error(s), 0 warning(s)
sec 2.7.261-beta-080905
-  sec.properties
+  sec.plugins

<- locale/wctrans/tests/wctrans_scenario.sei
generate:
-> locale/wctrans/tests/wctrans_scenario.c
0 error(s), 0 warning(s)
sec 2.7.261-beta-080905
-  sec.properties
+  sec.plugins

<- locale/wctype/wctype_media.sei
generate:
-> locale/wctype/wctype_media.c
0 error(s), 0 warning(s)
sec 2.7.261-beta-080905
-  sec.properties
+  sec.plugins

<- locale/wctype/wctype_model.sei
generate:
-> locale/wctype/wctype_model.c
0 error(s), 0 warning(s)
sec 2.7.261-beta-080905
-  sec.properties
+  sec.plugins

<- locale/wctype/tests/wctype_main.sei
generate:
-> locale/wctype/tests/wctype_main.c
0 error(s), 0 warning(s)
sec 2.7.261-beta-080905
-  sec.properties
+  sec.plugins

<- locale/wctype/tests/wctype_scenario.sei
generate:
-> locale/wctype/tests/wctype_scenario.c
0 error(s), 0 warning(s)
sec 2.7.261-beta-080905
-  sec.properties
+  sec.plugins

<- signal/sigaction/sigaction_media.sei
generate:
-> signal/sigaction/sigaction_media.c
0 error(s), 0 warning(s)
sec 2.7.261-beta-080905
-  sec.properties
+  sec.plugins

<- signal/sigaction/sigaction_model.sei
generate:
-> signal/sigaction/sigaction_model.c
0 error(s), 0 warning(s)
sec 2.7.261-beta-080905
-  sec.properties
+  sec.plugins

<- signal/sigaction/tests/sigaction_main.sei
generate:
-> signal/sigaction/tests/sigaction_main.c
0 error(s), 0 warning(s)
sec 2.7.261-beta-080905
-  sec.properties
+  sec.plugins

<- signal/sigaction/tests/sigaction_scenario.sei
generate:
-> signal/sigaction/tests/sigaction_scenario.c
0 error(s), 0 warning(s)
sec 2.7.261-beta-080905
-  sec.properties
+  sec.plugins

<- signal/sigctrl/sigctrl_media.sei
generate:
-> signal/sigctrl/sigctrl_media.c
0 error(s), 0 warning(s)
sec 2.7.261-beta-080905
-  sec.properties
+  sec.plugins

<- signal/sigctrl/sigctrl_model.sei
generate:
-> signal/sigctrl/sigctrl_model.c
0 error(s), 0 warning(s)
sec 2.7.261-beta-080905
-  sec.properties
+  sec.plugins

<- signal/sigctrl/tests/sigctrl_main.sei
generate:
-> signal/sigctrl/tests/sigctrl_main.c
0 error(s), 0 warning(s)
sec 2.7.261-beta-080905
-  sec.properties
+  sec.plugins

<- signal/sigctrl/tests/sigctrl_scenario.sei
generate:
-> signal/sigctrl/tests/sigctrl_scenario.c
0 error(s), 0 warning(s)
sec 2.7.261-beta-080905
-  sec.properties
+  sec.plugins

<- signal/sigsend/sigsend_media.sei
generate:
-> signal/sigsend/sigsend_media.c
0 error(s), 0 warning(s)
sec 2.7.261-beta-080905
-  sec.properties
+  sec.plugins

<- signal/sigsend/sigsend_model.sei
generate:
-> signal/sigsend/sigsend_model.c
0 error(s), 0 warning(s)
sec 2.7.261-beta-080905
-  sec.properties
+  sec.plugins

<- signal/sigsend/tests/signal_specific_scenario.sei
generate:
-> signal/sigsend/tests/signal_specific_scenario.c
0 error(s), 0 warning(s)
sec 2.7.261-beta-080905
-  sec.properties
+  sec.plugins

<- signal/sigsend/tests/sigsend_additional_scenario.sei
generate:
-> signal/sigsend/tests/sigsend_additional_scenario.c
0 error(s), 0 warning(s)
sec 2.7.261-beta-080905
-  sec.properties
+  sec.plugins

<- signal/sigsend/tests/sigsend_main.sei
generate:
-> signal/sigsend/tests/sigsend_main.c
0 error(s), 0 warning(s)
sec 2.7.261-beta-080905
-  sec.properties
+  sec.plugins

<- signal/sigsend/tests/sigsend_scenario.sei
generate:
-> signal/sigsend/tests/sigsend_scenario.c
0 error(s), 0 warning(s)
sec 2.7.261-beta-080905
-  sec.properties
+  sec.plugins

<- signal/sigset/sigset_media.sei
generate:
-> signal/sigset/sigset_media.c
0 error(s), 0 warning(s)
sec 2.7.261-beta-080905
-  sec.properties
+  sec.plugins

<- signal/sigset/sigset_model.sei
generate:
-> signal/sigset/sigset_model.c
0 error(s), 0 warning(s)
sec 2.7.261-beta-080905
-  sec.properties
+  sec.plugins

<- signal/sigset/tests/sigset_automatic_scenario.sei
generate:
-> signal/sigset/tests/sigset_automatic_scenario.c
0 error(s), 0 warning(s)
sec 2.7.261-beta-080905
-  sec.properties
+  sec.plugins

<- signal/sigset/tests/sigset_main.sei
generate:
-> signal/sigset/tests/sigset_main.c
0 error(s), 0 warning(s)
sec 2.7.261-beta-080905
-  sec.properties
+  sec.plugins

<- signal/sigset/tests/sigset_scenario.sei
generate:
-> signal/sigset/tests/sigset_scenario.c
0 error(s), 0 warning(s)
sec 2.7.261-beta-080905
-  sec.properties
+  sec.plugins

<- signal/sigset/tests/sigset_static_scenario.sei
generate:
-> signal/sigset/tests/sigset_static_scenario.c
0 error(s), 0 warning(s)
sec 2.7.261-beta-080905
-  sec.properties
+  sec.plugins

<- signal/sigstr/sigstr_media.sei
generate:
-> signal/sigstr/sigstr_media.c
0 error(s), 0 warning(s)
sec 2.7.261-beta-080905
-  sec.properties
+  sec.plugins

<- signal/sigstr/sigstr_model.sei
generate:
-> signal/sigstr/sigstr_model.c
0 error(s), 0 warning(s)
sec 2.7.261-beta-080905
-  sec.properties
+  sec.plugins

<- signal/sigstr/tests/sigstr_main.sei
generate:
-> signal/sigstr/tests/sigstr_main.c
0 error(s), 0 warning(s)
sec 2.7.261-beta-080905
-  sec.properties
+  sec.plugins

<- signal/sigstr/tests/sigstr_scenario.sei
generate:
signal/sigstr/tests/sigstr_scenario.sec(30,5): warning: implicit declaration of function 'initSignalToString'.
-> signal/sigstr/tests/sigstr_scenario.c
0 error(s), 1 warning(s)
sec 2.7.261-beta-080905
-  sec.properties
+  sec.plugins

<- signal/sigwait/sigwait_media.sei
generate:
-> signal/sigwait/sigwait_media.c
0 error(s), 0 warning(s)
sec 2.7.261-beta-080905
-  sec.properties
+  sec.plugins

<- signal/sigwait/sigwait_model.sei
generate:
-> signal/sigwait/sigwait_model.c
0 error(s), 0 warning(s)
sec 2.7.261-beta-080905
-  sec.properties
+  sec.plugins

<- signal/sigwait/tests/sigwait_main.sei
generate:
-> signal/sigwait/tests/sigwait_main.c
0 error(s), 0 warning(s)
sec 2.7.261-beta-080905
-  sec.properties
+  sec.plugins

<- signal/sigwait/tests/sigwait_scenario.sei
generate:
signal/sigwait/tests/sigwait_scenario.sec(74,5): warning: implicit declaration of function 'initSignalToString'.
-> signal/sigwait/tests/sigwait_scenario.c
0 error(s), 1 warning(s)
sec 2.7.261-beta-080905
-  sec.properties
+  sec.plugins

<- socket/netdata/netdata_media.sei
generate:
-> socket/netdata/netdata_media.c
0 error(s), 0 warning(s)
sec 2.7.261-beta-080905
-  sec.properties
+  sec.plugins

<- socket/netdata/netdata_model.sei
generate:
-> socket/netdata/netdata_model.c
0 error(s), 0 warning(s)
sec 2.7.261-beta-080905
-  sec.properties
+  sec.plugins

<- socket/netdata/tests/netdata_main.sei
generate:
-> socket/netdata/tests/netdata_main.c
0 error(s), 0 warning(s)
sec 2.7.261-beta-080905
-  sec.properties
+  sec.plugins

<- socket/netdata/tests/netdata_scenario.sei
generate:
-> socket/netdata/tests/netdata_scenario.c
0 error(s), 0 warning(s)
sec 2.7.261-beta-080905
-  sec.properties
+  sec.plugins

<- socket/netdb/netdb_media.sei
generate:
-> socket/netdb/netdb_media.c
0 error(s), 0 warning(s)
sec 2.7.261-beta-080905
-  sec.properties
+  sec.plugins

<- socket/netdb/netdb_model.sei
generate:
-> socket/netdb/netdb_model.c
0 error(s), 0 warning(s)
sec 2.7.261-beta-080905
-  sec.properties
+  sec.plugins

<- socket/netdb/tests/netdb_main.sei
generate:
-> socket/netdb/tests/netdb_main.c
0 error(s), 0 warning(s)
sec 2.7.261-beta-080905
-  sec.properties
+  sec.plugins

<- socket/netdb/tests/netdb_scenario.sei
generate:
-> socket/netdb/tests/netdb_scenario.c
0 error(s), 0 warning(s)
sec 2.7.261-beta-080905
-  sec.properties
+  sec.plugins

<- socket/netif/netif_media.sei
generate:
-> socket/netif/netif_media.c
0 error(s), 0 warning(s)
sec 2.7.261-beta-080905
-  sec.properties
+  sec.plugins

<- socket/netif/netif_model.sei
generate:
-> socket/netif/netif_model.c
0 error(s), 0 warning(s)
sec 2.7.261-beta-080905
-  sec.properties
+  sec.plugins

<- socket/netif/tests/netif_main.sei
generate:
-> socket/netif/tests/netif_main.c
0 error(s), 0 warning(s)
sec 2.7.261-beta-080905
-  sec.properties
+  sec.plugins

<- socket/netif/tests/netif_scenario.sei
generate:
-> socket/netif/tests/netif_scenario.c
0 error(s), 0 warning(s)
sec 2.7.261-beta-080905
-  sec.properties
+  sec.plugins

<- socket/rpc/clnt_media.sei
generate:
-> socket/rpc/clnt_media.c
0 error(s), 0 warning(s)
sec 2.7.261-beta-080905
-  sec.properties
+  sec.plugins

<- socket/rpc/clnt_model.sei
generate:
-> socket/rpc/clnt_model.c
0 error(s), 0 warning(s)
sec 2.7.261-beta-080905
-  sec.properties
+  sec.plugins

<- socket/rpc/pmap_media.sei
generate:
-> socket/rpc/pmap_media.c
0 error(s), 0 warning(s)
sec 2.7.261-beta-080905
-  sec.properties
+  sec.plugins

<- socket/rpc/pmap_model.sei
generate:
-> socket/rpc/pmap_model.c
0 error(s), 0 warning(s)
sec 2.7.261-beta-080905
-  sec.properties
+  sec.plugins

<- socket/rpc/secure_media.sei
generate:
-> socket/rpc/secure_media.c
0 error(s), 0 warning(s)
sec 2.7.261-beta-080905
-  sec.properties
+  sec.plugins

<- socket/rpc/secure_model.sei
generate:
-> socket/rpc/secure_model.c
0 error(s), 0 warning(s)
sec 2.7.261-beta-080905
-  sec.properties
+  sec.plugins

<- socket/rpc/svc_media.sei
generate:
-> socket/rpc/svc_media.c
0 error(s), 0 warning(s)
sec 2.7.261-beta-080905
-  sec.properties
+  sec.plugins

<- socket/rpc/svc_model.sei
generate:
-> socket/rpc/svc_model.c
0 error(s), 0 warning(s)
sec 2.7.261-beta-080905
-  sec.properties
+  sec.plugins

<- socket/rpc/xdr_media.sei
generate:
-> socket/rpc/xdr_media.c
0 error(s), 0 warning(s)
sec 2.7.261-beta-080905
-  sec.properties
+  sec.plugins

<- socket/rpc/xdr_model.sei
generate:
-> socket/rpc/xdr_model.c
0 error(s), 0 warning(s)
sec 2.7.261-beta-080905
-  sec.properties
+  sec.plugins

<- socket/rpc/tests/pmap_scenario.sei
generate:
-> socket/rpc/tests/pmap_scenario.c
0 error(s), 0 warning(s)
sec 2.7.261-beta-080905
-  sec.properties
+  sec.plugins

<- socket/rpc/tests/rpc_main.sei
generate:
-> socket/rpc/tests/rpc_main.c
0 error(s), 0 warning(s)
sec 2.7.261-beta-080905
-  sec.properties
+  sec.plugins

<- socket/rpc/tests/secure_scenario.sei
generate:
-> socket/rpc/tests/secure_scenario.c
0 error(s), 0 warning(s)
sec 2.7.261-beta-080905
-  sec.properties
+  sec.plugins

<- socket/rpc/tests/svc_clnt_scenario.sei
generate:
-> socket/rpc/tests/svc_clnt_scenario.c
0 error(s), 0 warning(s)
sec 2.7.261-beta-080905
-  sec.properties
+  sec.plugins

<- socket/rpc/tests/xdr_scenario.sei
generate:
-> socket/rpc/tests/xdr_scenario.c
0 error(s), 0 warning(s)
sec 2.7.261-beta-080905
-  sec.properties
+  sec.plugins

<- socket/socket/socket_media.sei
generate:
-> socket/socket/socket_media.c
0 error(s), 0 warning(s)
sec 2.7.261-beta-080905
-  sec.properties
+  sec.plugins

<- socket/socket/socket_model.sei
generate:
-> socket/socket/socket_model.c
0 error(s), 0 warning(s)
sec 2.7.261-beta-080905
-  sec.properties
+  sec.plugins

<- socket/socket/tests/socket_main.sei
generate:
-> socket/socket/tests/socket_main.c
0 error(s), 0 warning(s)
sec 2.7.261-beta-080905
-  sec.properties
+  sec.plugins

<- socket/socket/tests/socket_scenario.sei
generate:
-> socket/socket/tests/socket_scenario.c
0 error(s), 0 warning(s)
sec 2.7.261-beta-080905
-  sec.properties
+  sec.plugins

<- time/clock/clock_media.sei
generate:
-> time/clock/clock_media.c
0 error(s), 0 warning(s)
sec 2.7.261-beta-080905
-  sec.properties
+  sec.plugins

<- time/clock/clock_model.sei
generate:
-> time/clock/clock_model.c
0 error(s), 0 warning(s)
sec 2.7.261-beta-080905
-  sec.properties
+  sec.plugins

<- time/clock/tests/clock_main.sei
generate:
-> time/clock/tests/clock_main.c
0 error(s), 0 warning(s)
sec 2.7.261-beta-080905
-  sec.properties
+  sec.plugins

<- time/clock/tests/clock_scenario.sei
generate:
-> time/clock/tests/clock_scenario.c
0 error(s), 0 warning(s)
sec 2.7.261-beta-080905
-  sec.properties
+  sec.plugins

<- time/conversion/conversion_media.sei
generate:
-> time/conversion/conversion_media.c
0 error(s), 0 warning(s)
sec 2.7.261-beta-080905
-  sec.properties
+  sec.plugins

<- time/conversion/conversion_model.sei
generate:
-> time/conversion/conversion_model.c
0 error(s), 0 warning(s)
sec 2.7.261-beta-080905
-  sec.properties
+  sec.plugins

<- time/conversion/tests/conversion_main.sei
generate:
-> time/conversion/tests/conversion_main.c
0 error(s), 0 warning(s)
sec 2.7.261-beta-080905
-  sec.properties
+  sec.plugins

<- time/conversion/tests/conversion_scenario.sei
generate:
-> time/conversion/tests/conversion_scenario.c
0 error(s), 0 warning(s)
sec 2.7.261-beta-080905
-  sec.properties
+  sec.plugins

<- time/time/time_media.sei
generate:
-> time/time/time_media.c
0 error(s), 0 warning(s)
sec 2.7.261-beta-080905
-  sec.properties
+  sec.plugins

<- time/time/time_model.sei
generate:
-> time/time/time_model.c
0 error(s), 0 warning(s)
sec 2.7.261-beta-080905
-  sec.properties
+  sec.plugins

<- time/time/tests/time_main.sei
generate:
-> time/time/tests/time_main.c
0 error(s), 0 warning(s)
sec 2.7.261-beta-080905
-  sec.properties
+  sec.plugins

<- time/time/tests/time_scenario.sei
generate:
-> time/time/tests/time_scenario.c
0 error(s), 0 warning(s)
sec 2.7.261-beta-080905
-  sec.properties
+  sec.plugins

<- time/timer/timer_media.sei
generate:
-> time/timer/timer_media.c
0 error(s), 0 warning(s)
sec 2.7.261-beta-080905
-  sec.properties
+  sec.plugins

<- time/timer/timer_model.sei
generate:
-> time/timer/timer_model.c
0 error(s), 0 warning(s)
sec 2.7.261-beta-080905
-  sec.properties
+  sec.plugins

<- time/timer/tests/timer_main.sei
generate:
-> time/timer/tests/timer_main.c
0 error(s), 0 warning(s)
sec 2.7.261-beta-080905
-  sec.properties
+  sec.plugins

<- time/timer/tests/timer_scenario.sei
generate:
-> time/timer/tests/timer_scenario.c
0 error(s), 0 warning(s)
sec 2.7.261-beta-080905
-  sec.properties
+  sec.plugins

<- ncurses/bkgd/bkgd_media.sei
generate:
-> ncurses/bkgd/bkgd_media.c
0 error(s), 0 warning(s)
sec 2.7.261-beta-080905
-  sec.properties
+  sec.plugins

<- ncurses/bkgd/bkgd_model.sei
generate:
-> ncurses/bkgd/bkgd_model.c
0 error(s), 0 warning(s)
sec 2.7.261-beta-080905
-  sec.properties
+  sec.plugins

<- ncurses/bkgd/tests/bkgd_main.sei
generate:
-> ncurses/bkgd/tests/bkgd_main.c
0 error(s), 0 warning(s)
sec 2.7.261-beta-080905
-  sec.properties
+  sec.plugins

<- ncurses/bkgd/tests/bkgd_scenario.sei
generate:
-> ncurses/bkgd/tests/bkgd_scenario.c
0 error(s), 0 warning(s)
sec 2.7.261-beta-080905
-  sec.properties
+  sec.plugins

<- ncurses/border/border_media.sei
generate:
-> ncurses/border/border_media.c
0 error(s), 0 warning(s)
sec 2.7.261-beta-080905
-  sec.properties
+  sec.plugins

<- ncurses/border/border_model.sei
generate:
-> ncurses/border/border_model.c
0 error(s), 0 warning(s)
sec 2.7.261-beta-080905
-  sec.properties
+  sec.plugins

<- ncurses/border/tests/border_main.sei
generate:
-> ncurses/border/tests/border_main.c
0 error(s), 0 warning(s)
sec 2.7.261-beta-080905
-  sec.properties
+  sec.plugins

<- ncurses/border/tests/border_scenario.sei
generate:
-> ncurses/border/tests/border_scenario.c
0 error(s), 0 warning(s)
sec 2.7.261-beta-080905
-  sec.properties
+  sec.plugins

<- ncurses/char/add_media.sei
generate:
-> ncurses/char/add_media.c
0 error(s), 0 warning(s)
sec 2.7.261-beta-080905
-  sec.properties
+  sec.plugins

<- ncurses/char/add_model.sei
generate:
-> ncurses/char/add_model.c
0 error(s), 0 warning(s)
sec 2.7.261-beta-080905
-  sec.properties
+  sec.plugins

<- ncurses/char/input_media.sei
generate:
-> ncurses/char/input_media.c
0 error(s), 0 warning(s)
sec 2.7.261-beta-080905
-  sec.properties
+  sec.plugins

<- ncurses/char/input_model.sei
generate:
-> ncurses/char/input_model.c
0 error(s), 0 warning(s)
sec 2.7.261-beta-080905
-  sec.properties
+  sec.plugins

<- ncurses/char/insert_media.sei
generate:
-> ncurses/char/insert_media.c
0 error(s), 0 warning(s)
sec 2.7.261-beta-080905
-  sec.properties
+  sec.plugins

<- ncurses/char/insert_model.sei
generate:
-> ncurses/char/insert_model.c
0 error(s), 0 warning(s)
sec 2.7.261-beta-080905
-  sec.properties
+  sec.plugins

<- ncurses/char/tests/add_scenario.sei
generate:
-> ncurses/char/tests/add_scenario.c
0 error(s), 0 warning(s)
sec 2.7.261-beta-080905
-  sec.properties
+  sec.plugins

<- ncurses/char/tests/char_main.sei
generate:
-> ncurses/char/tests/char_main.c
0 error(s), 0 warning(s)
sec 2.7.261-beta-080905
-  sec.properties
+  sec.plugins

<- ncurses/char/tests/input_scenario.sei
generate:
-> ncurses/char/tests/input_scenario.c
0 error(s), 0 warning(s)
sec 2.7.261-beta-080905
-  sec.properties
+  sec.plugins

<- ncurses/char/tests/insert_scenario.sei
generate:
-> ncurses/char/tests/insert_scenario.c
0 error(s), 0 warning(s)
sec 2.7.261-beta-080905
-  sec.properties
+  sec.plugins

<- ncurses/chgat/chgat_media.sei
generate:
-> ncurses/chgat/chgat_media.c
0 error(s), 0 warning(s)
sec 2.7.261-beta-080905
-  sec.properties
+  sec.plugins

<- ncurses/chgat/chgat_model.sei
generate:
-> ncurses/chgat/chgat_model.c
0 error(s), 0 warning(s)
sec 2.7.261-beta-080905
-  sec.properties
+  sec.plugins

<- ncurses/chgat/tests/chgat_main.sei
generate:
-> ncurses/chgat/tests/chgat_main.c
0 error(s), 0 warning(s)
sec 2.7.261-beta-080905
-  sec.properties
+  sec.plugins

<- ncurses/chgat/tests/chgat_scenario.sei
generate:
-> ncurses/chgat/tests/chgat_scenario.c
0 error(s), 0 warning(s)
sec 2.7.261-beta-080905
-  sec.properties
+  sec.plugins

<- ncurses/chstr/add_media.sei
generate:
-> ncurses/chstr/add_media.c
0 error(s), 0 warning(s)
sec 2.7.261-beta-080905
-  sec.properties
+  sec.plugins

<- ncurses/chstr/add_model.sei
generate:
-> ncurses/chstr/add_model.c
0 error(s), 0 warning(s)
sec 2.7.261-beta-080905
-  sec.properties
+  sec.plugins

<- ncurses/chstr/input_media.sei
generate:
-> ncurses/chstr/input_media.c
0 error(s), 0 warning(s)
sec 2.7.261-beta-080905
-  sec.properties
+  sec.plugins

<- ncurses/chstr/input_model.sei
generate:
-> ncurses/chstr/input_model.c
0 error(s), 0 warning(s)
sec 2.7.261-beta-080905
-  sec.properties
+  sec.plugins

<- ncurses/chstr/tests/add_scenario.sei
generate:
-> ncurses/chstr/tests/add_scenario.c
0 error(s), 0 warning(s)
sec 2.7.261-beta-080905
-  sec.properties
+  sec.plugins

<- ncurses/chstr/tests/chstr_main.sei
generate:
-> ncurses/chstr/tests/chstr_main.c
0 error(s), 0 warning(s)
sec 2.7.261-beta-080905
-  sec.properties
+  sec.plugins

<- ncurses/chstr/tests/input_scenario.sei
generate:
-> ncurses/chstr/tests/input_scenario.c
0 error(s), 0 warning(s)
sec 2.7.261-beta-080905
-  sec.properties
+  sec.plugins

<- ncurses/clear/clear_media.sei
generate:
-> ncurses/clear/clear_media.c
0 error(s), 0 warning(s)
sec 2.7.261-beta-080905
-  sec.properties
+  sec.plugins

<- ncurses/clear/clear_model.sei
generate:
-> ncurses/clear/clear_model.c
0 error(s), 0 warning(s)
sec 2.7.261-beta-080905
-  sec.properties
+  sec.plugins

<- ncurses/clear/tests/clear_main.sei
generate:
-> ncurses/clear/tests/clear_main.c
0 error(s), 0 warning(s)
sec 2.7.261-beta-080905
-  sec.properties
+  sec.plugins

<- ncurses/clear/tests/clear_scenario.sei
generate:
-> ncurses/clear/tests/clear_scenario.c
0 error(s), 0 warning(s)
sec 2.7.261-beta-080905
-  sec.properties
+  sec.plugins

<- ncurses/color/color_media.sei
generate:
-> ncurses/color/color_media.c
0 error(s), 0 warning(s)
sec 2.7.261-beta-080905
-  sec.properties
+  sec.plugins

<- ncurses/color/color_model.sei
generate:
-> ncurses/color/color_model.c
0 error(s), 0 warning(s)
sec 2.7.261-beta-080905
-  sec.properties
+  sec.plugins

<- ncurses/color/tests/color_main.sei
generate:
-> ncurses/color/tests/color_main.c
0 error(s), 0 warning(s)
sec 2.7.261-beta-080905
-  sec.properties
+  sec.plugins

<- ncurses/color/tests/color_scenario.sei
generate:
-> ncurses/color/tests/color_scenario.c
0 error(s), 0 warning(s)
sec 2.7.261-beta-080905
-  sec.properties
+  sec.plugins

<- ncurses/input/char_media.sei
generate:
-> ncurses/input/char_media.c
0 error(s), 0 warning(s)
sec 2.7.261-beta-080905
-  sec.properties
+  sec.plugins

<- ncurses/input/char_model.sei
generate:
-> ncurses/input/char_model.c
0 error(s), 0 warning(s)
sec 2.7.261-beta-080905
-  sec.properties
+  sec.plugins

<- ncurses/input/input_media.sei
generate:
-> ncurses/input/input_media.c
0 error(s), 0 warning(s)
sec 2.7.261-beta-080905
-  sec.properties
+  sec.plugins

<- ncurses/input/input_model.sei
generate:
-> ncurses/input/input_model.c
0 error(s), 0 warning(s)
sec 2.7.261-beta-080905
-  sec.properties
+  sec.plugins

<- ncurses/input/string_media.sei
generate:
-> ncurses/input/string_media.c
0 error(s), 0 warning(s)
sec 2.7.261-beta-080905
-  sec.properties
+  sec.plugins

<- ncurses/input/string_model.sei
generate:
-> ncurses/input/string_model.c
0 error(s), 0 warning(s)
sec 2.7.261-beta-080905
-  sec.properties
+  sec.plugins

<- ncurses/input/timeout_media.sei
generate:
-> ncurses/input/timeout_media.c
0 error(s), 0 warning(s)
sec 2.7.261-beta-080905
-  sec.properties
+  sec.plugins

<- ncurses/input/timeout_model.sei
generate:
-> ncurses/input/timeout_model.c
0 error(s), 0 warning(s)
sec 2.7.261-beta-080905
-  sec.properties
+  sec.plugins

<- ncurses/input/tests/char_scenario.sei
generate:
-> ncurses/input/tests/char_scenario.c
0 error(s), 0 warning(s)
sec 2.7.261-beta-080905
-  sec.properties
+  sec.plugins

<- ncurses/input/tests/input_main.sei
generate:
-> ncurses/input/tests/input_main.c
0 error(s), 0 warning(s)
sec 2.7.261-beta-080905
-  sec.properties
+  sec.plugins

<- ncurses/input/tests/input_scenario.sei
generate:
-> ncurses/input/tests/input_scenario.c
0 error(s), 0 warning(s)
sec 2.7.261-beta-080905
-  sec.properties
+  sec.plugins

<- ncurses/input/tests/string_scenario.sei
generate:
-> ncurses/input/tests/string_scenario.c
0 error(s), 0 warning(s)
sec 2.7.261-beta-080905
-  sec.properties
+  sec.plugins

<- ncurses/input/tests/timeout_scenario.sei
generate:
-> ncurses/input/tests/timeout_scenario.c
0 error(s), 0 warning(s)
sec 2.7.261-beta-080905
-  sec.properties
+  sec.plugins

<- ncurses/line/line_media.sei
generate:
-> ncurses/line/line_media.c
0 error(s), 0 warning(s)
sec 2.7.261-beta-080905
-  sec.properties
+  sec.plugins

<- ncurses/line/line_model.sei
generate:
-> ncurses/line/line_model.c
0 error(s), 0 warning(s)
sec 2.7.261-beta-080905
-  sec.properties
+  sec.plugins

<- ncurses/line/tests/line_main.sei
generate:
-> ncurses/line/tests/line_main.c
0 error(s), 0 warning(s)
sec 2.7.261-beta-080905
-  sec.properties
+  sec.plugins

<- ncurses/line/tests/line_scenario.sei
generate:
-> ncurses/line/tests/line_scenario.c
0 error(s), 0 warning(s)
sec 2.7.261-beta-080905
-  sec.properties
+  sec.plugins

<- ncurses/misc/misc_media.sei
generate:
-> ncurses/misc/misc_media.c
0 error(s), 0 warning(s)
sec 2.7.261-beta-080905
-  sec.properties
+  sec.plugins

<- ncurses/misc/misc_model.sei
generate:
-> ncurses/misc/misc_model.c
0 error(s), 0 warning(s)
sec 2.7.261-beta-080905
-  sec.properties
+  sec.plugins

<- ncurses/misc/tests/misc_main.sei
generate:
-> ncurses/misc/tests/misc_main.c
0 error(s), 0 warning(s)
sec 2.7.261-beta-080905
-  sec.properties
+  sec.plugins

<- ncurses/misc/tests/misc_scenario.sei
generate:
-> ncurses/misc/tests/misc_scenario.c
0 error(s), 0 warning(s)
sec 2.7.261-beta-080905
-  sec.properties
+  sec.plugins

<- ncurses/mode/mode_media.sei
generate:
-> ncurses/mode/mode_media.c
0 error(s), 0 warning(s)
sec 2.7.261-beta-080905
-  sec.properties
+  sec.plugins

<- ncurses/mode/mode_model.sei
generate:
-> ncurses/mode/mode_model.c
0 error(s), 0 warning(s)
sec 2.7.261-beta-080905
-  sec.properties
+  sec.plugins

<- ncurses/mode/tests/mode_main.sei
generate:
-> ncurses/mode/tests/mode_main.c
0 error(s), 0 warning(s)
sec 2.7.261-beta-080905
-  sec.properties
+  sec.plugins

<- ncurses/mode/tests/mode_scenario.sei
generate:
-> ncurses/mode/tests/mode_scenario.c
0 error(s), 0 warning(s)
sec 2.7.261-beta-080905
-  sec.properties
+  sec.plugins

<- ncurses/move/move_media.sei
generate:
-> ncurses/move/move_media.c
0 error(s), 0 warning(s)
sec 2.7.261-beta-080905
-  sec.properties
+  sec.plugins

<- ncurses/move/move_model.sei
generate:
-> ncurses/move/move_model.c
0 error(s), 0 warning(s)
sec 2.7.261-beta-080905
-  sec.properties
+  sec.plugins

<- ncurses/move/tests/move_main.sei
generate:
-> ncurses/move/tests/move_main.c
0 error(s), 0 warning(s)
sec 2.7.261-beta-080905
-  sec.properties
+  sec.plugins

<- ncurses/move/tests/move_scenario.sei
generate:
-> ncurses/move/tests/move_scenario.c
0 error(s), 0 warning(s)
sec 2.7.261-beta-080905
-  sec.properties
+  sec.plugins

<- ncurses/screen/screen_media.sei
generate:
-> ncurses/screen/screen_media.c
0 error(s), 0 warning(s)
sec 2.7.261-beta-080905
-  sec.properties
+  sec.plugins

<- ncurses/screen/screen_model.sei
generate:
-> ncurses/screen/screen_model.c
0 error(s), 0 warning(s)
sec 2.7.261-beta-080905
-  sec.properties
+  sec.plugins

<- ncurses/screen/tests/screen_main.sei
generate:
-> ncurses/screen/tests/screen_main.c
0 error(s), 0 warning(s)
sec 2.7.261-beta-080905
-  sec.properties
+  sec.plugins

<- ncurses/screen/tests/screen_scenario.sei
generate:
-> ncurses/screen/tests/screen_scenario.c
0 error(s), 0 warning(s)
sec 2.7.261-beta-080905
-  sec.properties
+  sec.plugins

<- ncurses/slk/slk_media.sei
generate:
-> ncurses/slk/slk_media.c
0 error(s), 0 warning(s)
sec 2.7.261-beta-080905
-  sec.properties
+  sec.plugins

<- ncurses/slk/slk_model.sei
generate:
-> ncurses/slk/slk_model.c
0 error(s), 0 warning(s)
sec 2.7.261-beta-080905
-  sec.properties
+  sec.plugins

<- ncurses/slk/tests/slk_main.sei
generate:
-> ncurses/slk/tests/slk_main.c
0 error(s), 0 warning(s)
sec 2.7.261-beta-080905
-  sec.properties
+  sec.plugins

<- ncurses/slk/tests/slk_scenario.sei
generate:
-> ncurses/slk/tests/slk_scenario.c
0 error(s), 0 warning(s)
sec 2.7.261-beta-080905
-  sec.properties
+  sec.plugins

<- ncurses/string/add_media.sei
generate:
-> ncurses/string/add_media.c
0 error(s), 0 warning(s)
sec 2.7.261-beta-080905
-  sec.properties
+  sec.plugins

<- ncurses/string/add_model.sei
generate:
-> ncurses/string/add_model.c
0 error(s), 0 warning(s)
sec 2.7.261-beta-080905
-  sec.properties
+  sec.plugins

<- ncurses/string/input_media.sei
generate:
-> ncurses/string/input_media.c
0 error(s), 0 warning(s)
sec 2.7.261-beta-080905
-  sec.properties
+  sec.plugins

<- ncurses/string/input_model.sei
generate:
-> ncurses/string/input_model.c
0 error(s), 0 warning(s)
sec 2.7.261-beta-080905
-  sec.properties
+  sec.plugins

<- ncurses/string/insert_media.sei
generate:
-> ncurses/string/insert_media.c
0 error(s), 0 warning(s)
sec 2.7.261-beta-080905
-  sec.properties
+  sec.plugins

<- ncurses/string/insert_model.sei
generate:
-> ncurses/string/insert_model.c
0 error(s), 0 warning(s)
sec 2.7.261-beta-080905
-  sec.properties
+  sec.plugins

<- ncurses/string/printf_media.sei
generate:
-> ncurses/string/printf_media.c
0 error(s), 0 warning(s)
sec 2.7.261-beta-080905
-  sec.properties
+  sec.plugins

<- ncurses/string/printf_model.sei
generate:
-> ncurses/string/printf_model.c
0 error(s), 0 warning(s)
sec 2.7.261-beta-080905
-  sec.properties
+  sec.plugins

<- ncurses/string/scanf_media.sei
generate:
-> ncurses/string/scanf_media.c
0 error(s), 0 warning(s)
sec 2.7.261-beta-080905
-  sec.properties
+  sec.plugins

<- ncurses/string/scanf_model.sei
generate:
-> ncurses/string/scanf_model.c
0 error(s), 0 warning(s)
sec 2.7.261-beta-080905
-  sec.properties
+  sec.plugins

<- ncurses/string/tests/add_scenario.sei
generate:
-> ncurses/string/tests/add_scenario.c
0 error(s), 0 warning(s)
sec 2.7.261-beta-080905
-  sec.properties
+  sec.plugins

<- ncurses/string/tests/input_scenario.sei
generate:
-> ncurses/string/tests/input_scenario.c
0 error(s), 0 warning(s)
sec 2.7.261-beta-080905
-  sec.properties
+  sec.plugins

<- ncurses/string/tests/insert_scenario.sei
generate:
-> ncurses/string/tests/insert_scenario.c
0 error(s), 0 warning(s)
sec 2.7.261-beta-080905
-  sec.properties
+  sec.plugins

<- ncurses/string/tests/printf_scenario.sei
generate:
-> ncurses/string/tests/printf_scenario.c
0 error(s), 0 warning(s)
sec 2.7.261-beta-080905
-  sec.properties
+  sec.plugins

<- ncurses/string/tests/scanf_scenario.sei
generate:
-> ncurses/string/tests/scanf_scenario.c
0 error(s), 0 warning(s)
sec 2.7.261-beta-080905
-  sec.properties
+  sec.plugins

<- ncurses/string/tests/string_main.sei
generate:
-> ncurses/string/tests/string_main.c
0 error(s), 0 warning(s)
sec 2.7.261-beta-080905
-  sec.properties
+  sec.plugins

<- ncurses/terminal/control_media.sei
generate:
-> ncurses/terminal/control_media.c
0 error(s), 0 warning(s)
sec 2.7.261-beta-080905
-  sec.properties
+  sec.plugins

<- ncurses/terminal/control_model.sei
generate:
-> ncurses/terminal/control_model.c
0 error(s), 0 warning(s)
sec 2.7.261-beta-080905
-  sec.properties
+  sec.plugins

<- ncurses/terminal/termcap_media.sei
generate:
-> ncurses/terminal/termcap_media.c
0 error(s), 0 warning(s)
sec 2.7.261-beta-080905
-  sec.properties
+  sec.plugins

<- ncurses/terminal/termcap_model.sei
generate:
-> ncurses/terminal/termcap_model.c
0 error(s), 0 warning(s)
sec 2.7.261-beta-080905
-  sec.properties
+  sec.plugins

<- ncurses/terminal/terminal_media.sei
generate:
-> ncurses/terminal/terminal_media.c
0 error(s), 0 warning(s)
sec 2.7.261-beta-080905
-  sec.properties
+  sec.plugins

<- ncurses/terminal/terminal_model.sei
generate:
-> ncurses/terminal/terminal_model.c
0 error(s), 0 warning(s)
sec 2.7.261-beta-080905
-  sec.properties
+  sec.plugins

<- ncurses/terminal/terminfo_media.sei
generate:
-> ncurses/terminal/terminfo_media.c
0 error(s), 0 warning(s)
sec 2.7.261-beta-080905
-  sec.properties
+  sec.plugins

<- ncurses/terminal/terminfo_model.sei
generate:
-> ncurses/terminal/terminfo_model.c
0 error(s), 0 warning(s)
sec 2.7.261-beta-080905
-  sec.properties
+  sec.plugins

<- ncurses/terminal/tests/control_main.sei
generate:
-> ncurses/terminal/tests/control_main.c
0 error(s), 0 warning(s)
sec 2.7.261-beta-080905
-  sec.properties
+  sec.plugins

<- ncurses/terminal/tests/control_scenario.sei
generate:
-> ncurses/terminal/tests/control_scenario.c
0 error(s), 0 warning(s)
sec 2.7.261-beta-080905
-  sec.properties
+  sec.plugins

<- ncurses/terminal/tests/termcap_main.sei
generate:
-> ncurses/terminal/tests/termcap_main.c
0 error(s), 0 warning(s)
sec 2.7.261-beta-080905
-  sec.properties
+  sec.plugins

<- ncurses/terminal/tests/termcap_scenario.sei
generate:
-> ncurses/terminal/tests/termcap_scenario.c
0 error(s), 0 warning(s)
sec 2.7.261-beta-080905
-  sec.properties
+  sec.plugins

<- ncurses/terminal/tests/terminal_main.sei
generate:
-> ncurses/terminal/tests/terminal_main.c
0 error(s), 0 warning(s)
sec 2.7.261-beta-080905
-  sec.properties
+  sec.plugins

<- ncurses/terminal/tests/terminal_scenario.sei
generate:
-> ncurses/terminal/tests/terminal_scenario.c
0 error(s), 0 warning(s)
sec 2.7.261-beta-080905
-  sec.properties
+  sec.plugins

<- ncurses/terminal/tests/terminfo_scenario.sei
generate:
-> ncurses/terminal/tests/terminfo_scenario.c
0 error(s), 0 warning(s)
sec 2.7.261-beta-080905
-  sec.properties
+  sec.plugins

<- ncurses/window/attr_media.sei
generate:
-> ncurses/window/attr_media.c
0 error(s), 0 warning(s)
sec 2.7.261-beta-080905
-  sec.properties
+  sec.plugins

<- ncurses/window/attr_model.sei
generate:
-> ncurses/window/attr_model.c
0 error(s), 0 warning(s)
sec 2.7.261-beta-080905
-  sec.properties
+  sec.plugins

<- ncurses/window/pad_media.sei
generate:
-> ncurses/window/pad_media.c
0 error(s), 0 warning(s)
sec 2.7.261-beta-080905
-  sec.properties
+  sec.plugins

<- ncurses/window/pad_model.sei
generate:
-> ncurses/window/pad_model.c
0 error(s), 0 warning(s)
sec 2.7.261-beta-080905
-  sec.properties
+  sec.plugins

<- ncurses/window/refresh_media.sei
generate:
-> ncurses/window/refresh_media.c
0 error(s), 0 warning(s)
sec 2.7.261-beta-080905
-  sec.properties
+  sec.plugins

<- ncurses/window/refresh_model.sei
generate:
-> ncurses/window/refresh_model.c
0 error(s), 0 warning(s)
sec 2.7.261-beta-080905
-  sec.properties
+  sec.plugins

<- ncurses/window/scroll_media.sei
generate:
-> ncurses/window/scroll_media.c
0 error(s), 0 warning(s)
sec 2.7.261-beta-080905
-  sec.properties
+  sec.plugins

<- ncurses/window/scroll_model.sei
generate:
-> ncurses/window/scroll_model.c
0 error(s), 0 warning(s)
sec 2.7.261-beta-080905
-  sec.properties
+  sec.plugins

<- ncurses/window/window_media.sei
generate:
-> ncurses/window/window_media.c
0 error(s), 0 warning(s)
sec 2.7.261-beta-080905
-  sec.properties
+  sec.plugins

<- ncurses/window/window_model.sei
generate:
-> ncurses/window/window_model.c
0 error(s), 0 warning(s)
sec 2.7.261-beta-080905
-  sec.properties
+  sec.plugins

<- ncurses/window/tests/attr_scenario.sei
generate:
-> ncurses/window/tests/attr_scenario.c
0 error(s), 0 warning(s)
sec 2.7.261-beta-080905
-  sec.properties
+  sec.plugins

<- ncurses/window/tests/pad_scenario.sei
generate:
-> ncurses/window/tests/pad_scenario.c
0 error(s), 0 warning(s)
sec 2.7.261-beta-080905
-  sec.properties
+  sec.plugins

<- ncurses/window/tests/refresh_scenario.sei
generate:
-> ncurses/window/tests/refresh_scenario.c
0 error(s), 0 warning(s)
sec 2.7.261-beta-080905
-  sec.properties
+  sec.plugins

<- ncurses/window/tests/scroll_main.sei
generate:
-> ncurses/window/tests/scroll_main.c
0 error(s), 0 warning(s)
sec 2.7.261-beta-080905
-  sec.properties
+  sec.plugins

<- ncurses/window/tests/scroll_scenario.sei
generate:
-> ncurses/window/tests/scroll_scenario.c
0 error(s), 0 warning(s)
sec 2.7.261-beta-080905
-  sec.properties
+  sec.plugins

<- ncurses/window/tests/window_main.sei
generate:
-> ncurses/window/tests/window_main.c
0 error(s), 0 warning(s)
sec 2.7.261-beta-080905
-  sec.properties
+  sec.plugins

<- ncurses/window/tests/window_scenario.sei
generate:
-> ncurses/window/tests/window_scenario.c
0 error(s), 0 warning(s)
sec 2.7.261-beta-080905
-  sec.properties
+  sec.plugins

<- ncurses/ncurses/chtypearray.sei
generate:
-> ncurses/ncurses/chtypearray.c
0 error(s), 0 warning(s)
sec 2.7.261-beta-080905
-  sec.properties
+  sec.plugins

<- ncurses/ncurses/ncurses_data.sei
generate:
-> ncurses/ncurses/ncurses_data.c
0 error(s), 0 warning(s)
sec 2.7.261-beta-080905
-  sec.properties
+  sec.plugins

<- ncurses/ncurses/special_chars_scenario.sei
generate:
-> ncurses/ncurses/special_chars_scenario.c
0 error(s), 0 warning(s)
Compiling common/cbytearray.c
Compiling common/common_media.c
Compiling common/common_model.c
Compiling common/common_scenario.c
Compiling common/control_center.c
Compiling common/coverages.c
Compiling common/cstring.c
Compiling common/init.c
Compiling common/main.c
Compiling common/pointer.c
Compiling common/tree.c
Compiling common/tsstream.c
Compiling common/wchararray.c
Compiling common/wstring.c
Compiling config/config_loader.c
Compiling config/interpretation.c
Compiling config/pthread_config.c
Compiling config/system_config.c
Compiling config/type_config.c
Compiling core/core.c
Compiling data/basis.c
Compiling data/embed_model.c
Compiling data/locale_model.c
Compiling data/signal_model.c
Compiling data/time_model.c
Compiling data/wchar_model.c
Compiling data/sys/timeb_model.c
Compiling data/sys/time_model.c
Compiling fs/dir/dir_media.c
Compiling fs/dir/dir_model.c
Compiling fs/dir/tests/dir_main.c
Compiling fs/dir/tests/dir_scenario.c
Compiling fs/dir/tests/fs_dump.c
Compiling fs/fifo/fifo_media.c
Compiling fs/fifo/fifo_model.c
Compiling fs/fifo/tests/fifo_main.c
Compiling fs/fifo/tests/fifo_scenario.c
Compiling fs/fs/fs_media.c
Compiling fs/fs/fs_model.c
Compiling fs/fs/tests/fs_main.c
Compiling fs/fs/tests/fs_scenario.c
Compiling fs/ftw/ftw_media.c
Compiling fs/ftw/ftw_model.c
Compiling fs/ftw/tests/ftw_main.c
Compiling fs/ftw/tests/ftw_scenario.c
Compiling fs/glob/glob_media.c
Compiling fs/glob/glob_model.c
Compiling fs/glob/tests/glob_main.c
Compiling fs/glob/tests/glob_scenario.c
Compiling fs/meta/access_media.c
Compiling fs/meta/access_model.c
Compiling fs/meta/meta_media.c
Compiling fs/meta/meta_model.c
Compiling fs/meta/statvfs_media.c
Compiling fs/meta/statvfs_model.c
Compiling fs/meta/tests/access_scenario.c
Compiling fs/meta/tests/fs_meta_common_scenario.c
Compiling fs/meta/tests/meta_main.c
Compiling fs/meta/tests/meta_scenario.c
Compiling fs/meta/tests/statvfs_scenario.c
Compiling fs/name/name_media.c
Compiling fs/name/name_model.c
Compiling fs/name/tests/name_main.c
Compiling fs/name/tests/name_scenario.c
Compiling fs/symlink/symlink_media.c
Compiling fs/symlink/symlink_model.c
Compiling fs/symlink/tests/symlink_main.c
Compiling fs/symlink/tests/symlink_scenario.c
Compiling fs/tmpfile/tmpfile_media.c
Compiling fs/tmpfile/tmpfile_model.c
Compiling fs/tmpfile/tests/tmpfile_main.c
Compiling fs/tmpfile/tests/tmpfile_scenario.c
Compiling io/file/file_media.c
Compiling io/file/file_model.c
Compiling io/file/tests/file_lock_scenario.c
Compiling io/file/tests/file_main.c
Compiling io/file/tests/file_scenario.c
Compiling io/term/term_media.c
Compiling io/term/term_model.c
Compiling io/term/tests/cf_scenario.c
Compiling io/term/tests/cterm_scenario.c
Compiling io/term/tests/open_tty_scenario.c
Compiling io/term/tests/pt_scenario.c
Compiling io/term/tests/rw_canon_scenario.c
Compiling io/term/tests/rw_case_a_scenario.c
Compiling io/term/tests/rw_case_b_scenario.c
Compiling io/term/tests/rw_case_c_scenario.c
Compiling io/term/tests/rw_case_d_scenario.c
Compiling io/term/tests/tcpgrp_scenario.c
Compiling io/term/tests/tc_scenario.c
Compiling io/term/tests/term_main.c
Compiling io/term/tests/term_scenario.c
Compiling io/term/tests/tty_scenario.c
Compiling io/pipe/pipe_media.c
Compiling io/pipe/pipe_model.c
Compiling io/pipe/tests/pipe_main.c
Compiling io/pipe/tests/pipe_scenario.c
Compiling io/fstream/buffer_media.c
Compiling io/fstream/buffer_model.c
Compiling io/fstream/fstream_media.c
Compiling io/fstream/fstream_model.c
Compiling io/fstream/lock_media.c
Compiling io/fstream/lock_model.c
Compiling io/fstream/wstream_media.c
Compiling io/fstream/wstream_model.c
Compiling io/fstream/tests/buffer_scenario.c
Compiling io/fstream/tests/fstream_main.c
Compiling io/fstream/tests/fstream_scenario.c
Compiling io/fstream/tests/lock_scenario.c
Compiling io/fstream/tests/wstream_scenario.c
Compiling io/multiplex/multiplex_media.c
Compiling io/multiplex/multiplex_model.c
Compiling io/multiplex/tests/multiplex_main.c
Compiling io/multiplex/tests/multiplex_scenario.c
Compiling io/streams/streams_media.c
Compiling io/streams/streams_model.c
Compiling io/streams/tests/streams_main.c
Compiling io/streams/tests/streams_scenario.c
Compiling io/syslog/syslog_media.c
Compiling io/syslog/syslog_model.c
Compiling io/syslog/tests/syslog_main.c
Compiling io/syslog/tests/syslog_scenario.c
Compiling memory/heap/heap_media.c
Compiling memory/heap/heap_model.c
Compiling memory/heap/tests/heap_main.c
Compiling memory/heap/tests/heap_scenario.c
Compiling memory/heap/tests/memory_scenario.c
Compiling memory/mman/mman_media.c
Compiling memory/mman/mman_model.c
Compiling memory/mman/tests/mman_b1_scenario.c
Compiling memory/mman/tests/mman_errors_scenario.c
Compiling memory/mman/tests/mman_main.c
Compiling memory/mman/tests/mman_scenario.c
Compiling memory/mman/tests/mman_usualuse_scenario.c
Compiling memory/break/break_media.c
Compiling memory/break/break_model.c
Compiling memory/break/tests/break_main.c
Compiling memory/break/tests/break_scenario.c
Compiling process/process/process_common.c
Compiling process/process/process_media.c
Compiling process/process/process_model.c
Compiling process/process/tests/process_main.c
Compiling process/process/tests/process_scenario.c
Compiling process/fenv/fenv_common.c
Compiling process/fenv/fenv_media.c
Compiling process/fenv/fenv_model.c
Compiling process/fenv/tests/fenv_main.c
Compiling process/fenv/tests/fenv_scenario.c
Compiling process/meta/fs_media.c
Compiling process/meta/fs_model.c
Compiling process/meta/meta_media.c
Compiling process/meta/meta_model.c
Compiling process/meta/nice_media.c
Compiling process/meta/nice_model.c
Compiling process/meta/user_media.c
Compiling process/meta/user_model.c
Compiling process/meta/tests/fs_scenario.c
Compiling process/meta/tests/meta_main.c
Compiling process/meta/tests/meta_scenario.c
Compiling process/meta/tests/nice_scenario.c
Compiling process/meta/tests/user_scenario.c
Compiling process/environ/environ_media.c
Compiling process/environ/environ_model.c
Compiling process/environ/tests/environ_main.c
Compiling process/environ/tests/environ_scenario.c
Compiling process/context/context_media.c
Compiling process/context/context_model.c
Compiling process/context/tests/context_main.c
Compiling process/context/tests/context_scenario.c
Compiling process/goto/goto_media.c
Compiling process/goto/goto_model.c
Compiling process/goto/tests/goto_main.c
Compiling process/goto/tests/goto_scenario.c
Compiling process/ipc/ipc_media.c
Compiling process/ipc/ipc_model.c
Compiling process/ipc/msg_media.c
Compiling process/ipc/msg_model.c
Compiling process/ipc/sem_media.c
Compiling process/ipc/sem_model.c
process/ipc/sem_model.c:14197: warning: initialization from incompatible pointer type
Compiling process/ipc/shm_media.c
Compiling process/ipc/shm_model.c
Compiling process/ipc/tests/ipc_main.c
Compiling process/ipc/tests/ipc_scenario.c
Compiling process/ipc/tests/msg_scenario.c
Compiling process/ipc/tests/sem_scenario.c
Compiling process/ipc/tests/shm_scenario.c
Compiling process/pgroup/pgroup_media.c
Compiling process/pgroup/pgroup_model.c
Compiling process/pgroup/tests/pgroup_main.c
Compiling process/pgroup/tests/pgroup_scenario.c
Compiling process/resources/resources_media.c
Compiling process/resources/resources_model.c
Compiling process/resources/tests/resources_main.c
Compiling process/resources/tests/resources_scenario.c
Compiling process/scheduler/scheduler_media.c
Compiling process/scheduler/scheduler_model.c
Compiling process/scheduler/tests/scheduler_main.c
Compiling process/scheduler/tests/scheduler_scenario.c
Compiling pthread/mutex/mutexattr_media.c
Compiling pthread/mutex/mutexattr_model.c
Compiling pthread/mutex/mutex_media.c
Compiling pthread/mutex/mutex_model.c
Compiling pthread/mutex/tests/mutexattr_scenario.c
Compiling pthread/mutex/tests/mutex_main.c
Compiling pthread/mutex/tests/mutex_mixed_scenario.c
Compiling pthread/mutex/tests/mutex_mixed_types_scenario.c
Compiling pthread/mutex/tests/mutex_scenario.c
Compiling pthread/mutex/tests/mutex_simple_scenario.c
Compiling pthread/mutex/tests/mutex_static_init_scenario.c
Compiling pthread/pthread/pthread_media.c
Compiling pthread/pthread/pthread_model.c
Compiling pthread/pthread/tests/pthread_cleanup_diff_scenario.c
Compiling pthread/pthread/tests/pthread_cleanup_simple_scenario.c
Compiling pthread/pthread/tests/pthread_create_cancel_scenario.c
Compiling pthread/pthread/tests/pthread_exit_join_scenario.c
Compiling pthread/pthread/tests/pthread_main.c
Compiling pthread/pthread/tests/pthread_scenario.c
Compiling pthread/attr/attr_media.c
Compiling pthread/attr/attr_model.c
Compiling pthread/attr/tests/attr_main.c
Compiling pthread/attr/tests/attr_scenario.c
Compiling pthread/rwlock/rwlockattr_media.c
Compiling pthread/rwlock/rwlockattr_model.c
Compiling pthread/rwlock/rwlock_media.c
Compiling pthread/rwlock/rwlock_model.c
Compiling pthread/rwlock/tests/rwlockattr_scenario.c
Compiling pthread/rwlock/tests/rwlock_deadlock_scenario.c
Compiling pthread/rwlock/tests/rwlock_errors_scenario.c
Compiling pthread/rwlock/tests/rwlock_init_destroy_scenario.c
Compiling pthread/rwlock/tests/rwlock_main.c
Compiling pthread/rwlock/tests/rwlock_N_rwlock_light_scenario.c
Compiling pthread/rwlock/tests/rwlock_N_rwlock_scenario.c
Compiling pthread/rwlock/tests/rwlock_repeated_lock_scenario.c
Compiling pthread/rwlock/tests/rwlock_scenario.c
Compiling pthread/rwlock/tests/rwlock_single_rwlock_scenario.c
Compiling pthread/scheduler/scheduler_media.c
Compiling pthread/scheduler/scheduler_model.c
Compiling pthread/scheduler/tests/scheduler_main.c
Compiling pthread/scheduler/tests/scheduler_scenario.c
Compiling pthread/cond/condattr_media.c
Compiling pthread/cond/condattr_model.c
Compiling pthread/cond/cond_media.c
Compiling pthread/cond/cond_model.c
Compiling pthread/cond/tests/condattr_scenario.c
Compiling pthread/cond/tests/cond_error_scenario.c
Compiling pthread/cond/tests/cond_init_destroy_scenario.c
Compiling pthread/cond/tests/cond_main.c
Compiling pthread/cond/tests/cond_scenario.c
Compiling pthread/cond/tests/cond_single_cond_scenario.c
Compiling pthread/sem/sem_media.c
Compiling pthread/sem/sem_model.c
Compiling pthread/sem/tests/sem_complex_scenario.c
Compiling pthread/sem/tests/sem_error_scenario.c
Compiling pthread/sem/tests/sem_main.c
Compiling pthread/sem/tests/sem_open_close_scenario.c
Compiling pthread/sem/tests/sem_scenario.c
Compiling pthread/tls/tls_media.c
Compiling pthread/tls/tls_model.c
Compiling pthread/tls/tests/tls_main.c
Compiling pthread/tls/tests/tls_scenario.c
pthread/tls/tests/tls_scenario.c: In function ‘destr_scenario_indestr_expl’:
pthread/tls/tests/tls_scenario.c:21636: warning: cast from pointer to integer of different size
Compiling system/system/system_model.c
Compiling system/sysconf/sysconf_media.c
Compiling system/sysconf/sysconf_model.c
Compiling system/sysconf/tests/sysconf_main.c
Compiling system/sysconf/tests/sysconf_scenario.c
Compiling system/user/account_media.c
Compiling system/user/account_model.c
Compiling system/user/group_media.c
Compiling system/user/group_model.c
Compiling system/user/user_media.c
Compiling system/user/user_model.c
Compiling system/user/tests/account_scenario.c
Compiling system/user/tests/group_scenario.c
Compiling system/user/tests/user_main.c
Compiling system/user/tests/user_scenario.c
Compiling system/host/host_media.c
Compiling system/host/host_model.c
Compiling system/host/tests/host_main.c
Compiling system/host/tests/host_scenario.c
Compiling system/stat/stat_media.c
Compiling system/stat/stat_model.c
Compiling system/stat/tests/stat_main.c
Compiling system/stat/tests/stat_scenario.c
Compiling util/assert/assert_media.c
Compiling util/assert/assert_model.c
Compiling util/assert/tests/assert_main.c
Compiling util/assert/tests/assert_scenario.c
Compiling util/bit/bit_media.c
Compiling util/bit/bit_model.c
Compiling util/bit/tests/bit_main.c
Compiling util/bit/tests/bit_scenario.c
Compiling util/compress/compress_media.c
Compiling util/compress/compress_model.c
Compiling util/compress/tests/compress_main.c
Compiling util/compress/tests/compress_scenario.c
Compiling util/conversion/strint_media.c
Compiling util/conversion/strint_model.c
Compiling util/conversion/strreal_media.c
Compiling util/conversion/strreal_model.c
util/conversion/strreal_model.c: In function ‘ecvt_model’:
util/conversion/strreal_model.c:15445: warning: passing argument 2 of ‘ts_cast_spec_ref_lvalue’ from incompatible pointer type
util/conversion/strreal_model.c: In function ‘fcvt_model’:
util/conversion/strreal_model.c:15631: warning: passing argument 2 of ‘ts_cast_spec_ref_lvalue’ from incompatible pointer type
util/conversion/strreal_model.c: In function ‘gcvt_model’:
util/conversion/strreal_model.c:15816: warning: passing argument 2 of ‘ts_cast_spec_ref_lvalue’ from incompatible pointer type
Compiling util/conversion/token_media.c
Compiling util/conversion/token_model.c
Compiling util/conversion/util_conversion_common.c
Compiling util/conversion/wchar_media.c
Compiling util/conversion/wchar_model.c
Compiling util/conversion/wstrint_media.c
Compiling util/conversion/wstrint_model.c
Compiling util/conversion/wstrreal_media.c
Compiling util/conversion/wstrreal_model.c
Compiling util/conversion/wtoken_media.c
Compiling util/conversion/wtoken_model.c
Compiling util/conversion/tests/conversion_main.c
Compiling util/conversion/tests/strint_scenario.c
Compiling util/conversion/tests/strreal_scenario.c
Compiling util/conversion/tests/token_scenario.c
Compiling util/conversion/tests/wchar_scenario.c
Compiling util/conversion/tests/wstrint_scenario.c
Compiling util/conversion/tests/wstrreal_scenario.c
Compiling util/conversion/tests/wtoken_scenario.c
Compiling util/crypt/crypt_media.c
Compiling util/crypt/crypt_model.c
Compiling util/crypt/tests/crypt_main.c
Compiling util/crypt/tests/crypt_scenario.c
Compiling util/dl/dl_media.c
Compiling util/dl/dl_model.c
Compiling util/dl/tests/dl_main.c
Compiling util/dl/tests/dl_scenario.c
Compiling util/dl/tests/dl_syms.c
Compiling util/float/float_media.c
Compiling util/float/float_model.c
Compiling util/float/tests/float_main.c
Compiling util/float/tests/float_scenario.c
Compiling util/format/fmtmsg_media.c
Compiling util/format/fmtmsg_model.c
Compiling util/format/money_media.c
Compiling util/format/money_model.c
Compiling util/format/printf_media.c
Compiling util/format/printf_model.c
Compiling util/format/scanf_media.c
Compiling util/format/scanf_model.c
Compiling util/format/time_media.c
Compiling util/format/time_model.c
Compiling util/format/wprintf_media.c
Compiling util/format/wprintf_model.c
Compiling util/format/wscanf_media.c
Compiling util/format/wscanf_model.c
Compiling util/format/wtime_media.c
Compiling util/format/wtime_model.c
Compiling util/format/tests/fmtmsg_scenario.c
Compiling util/format/tests/format_main.c
Compiling util/format/tests/format_sheafs.c
Compiling util/format/tests/money_scenario.c
Compiling util/format/tests/printf_scenario_data.c
util/format/tests/printf_scenario_data.c: In function ‘getPrintedSheafAtom’:
util/format/tests/printf_scenario_data.c:3121: warning: passing argument 3 of ‘create_PrintedSheafAtom’ makes integer from pointer without a cast
util/format/tests/printf_scenario_data.c:3127: warning: passing argument 3 of ‘create_PrintedSheafAtom’ makes integer from pointer without a cast
util/format/tests/printf_scenario_data.c:3133: warning: passing argument 3 of ‘create_PrintedSheafAtom’ makes integer from pointer without a cast
util/format/tests/printf_scenario_data.c:3139: warning: passing argument 3 of ‘create_PrintedSheafAtom’ makes integer from pointer without a cast
util/format/tests/printf_scenario_data.c:3145: warning: passing argument 3 of ‘create_PrintedSheafAtom’ makes integer from pointer without a cast
util/format/tests/printf_scenario_data.c:3151: warning: passing argument 3 of ‘create_PrintedSheafAtom’ makes integer from pointer without a cast
util/format/tests/printf_scenario_data.c:3157: warning: passing argument 3 of ‘create_PrintedSheafAtom’ makes integer from pointer without a cast
util/format/tests/printf_scenario_data.c:3163: warning: passing argument 3 of ‘create_PrintedSheafAtom’ makes integer from pointer without a cast
Compiling util/format/tests/printf_scenario.c
Compiling util/format/tests/scanf_scenario_data.c
Compiling util/format/tests/scanf_scenario.c
Compiling util/format/tests/time_scenario.c
Compiling util/format/tests/wprintf_scenario_data.c
util/format/tests/wprintf_scenario_data.c: In function ‘getWprintedSheafAtom’:
util/format/tests/wprintf_scenario_data.c:17895: warning: passing argument 3 of ‘create_WprintedSheafAtom’ makes integer from pointer without a cast
util/format/tests/wprintf_scenario_data.c:17901: warning: passing argument 3 of ‘create_WprintedSheafAtom’ makes integer from pointer without a cast
util/format/tests/wprintf_scenario_data.c:17907: warning: passing argument 3 of ‘create_WprintedSheafAtom’ makes integer from pointer without a cast
util/format/tests/wprintf_scenario_data.c:17913: warning: passing argument 3 of ‘create_WprintedSheafAtom’ makes integer from pointer without a cast
util/format/tests/wprintf_scenario_data.c:17919: warning: passing argument 3 of ‘create_WprintedSheafAtom’ makes integer from pointer without a cast
util/format/tests/wprintf_scenario_data.c:17925: warning: passing argument 3 of ‘create_WprintedSheafAtom’ makes integer from pointer without a cast
util/format/tests/wprintf_scenario_data.c:17931: warning: passing argument 3 of ‘create_WprintedSheafAtom’ makes integer from pointer without a cast
util/format/tests/wprintf_scenario_data.c:17937: warning: passing argument 3 of ‘create_WprintedSheafAtom’ makes integer from pointer without a cast
Compiling util/format/tests/wprintf_scenario.c
Compiling util/format/tests/wscanf_scenario_data.c
Compiling util/format/tests/wscanf_scenario.c
Compiling util/format/tests/wtime_scenario.c
Compiling util/getopt/getopt_media.c
Compiling util/getopt/getopt_model.c
Compiling util/getopt/getopt.c
Compiling util/getopt/tests/getopt_main.c
Compiling util/getopt/tests/getopt_scenario.c
Compiling util/inet/inet_media.c
Compiling util/inet/inet_model.c
Compiling util/inet/tests/inet_main.c
Compiling util/inet/tests/inet_scenario.c
Compiling util/pam/pam_media.c
Compiling util/pam/pam_model.c
Compiling util/pam/tests/pam_main.c
Compiling util/pam/tests/pam_scenario.c
Compiling util/regex/regex_media.c
Compiling util/regex/regex_model.c
Compiling util/regex/tests/regex_main.c
Compiling util/regex/tests/regex_scenario.c
Compiling util/search/hash_media.c
Compiling util/search/hash_model.c
Compiling util/search/queue_media.c
Compiling util/search/queue_model.c
Compiling util/search/search_media.c
Compiling util/search/search_model.c
Compiling util/search/tree_media.c
Compiling util/search/tree_model.c
util/search/tree_model.c: In function ‘search_Tree’:
util/search/tree_model.c:13555: warning: passing argument 2 of ‘ts_cast_spec_ref_lvalue’ from incompatible pointer type
Compiling util/search/tests/hash_scenario.c
Compiling util/search/tests/queue_scenario.c
Compiling util/search/tests/search_main.c
Compiling util/search/tests/search_scenario.c
Compiling util/search/tests/tree_scenario.c
Compiling util/string/casecmp_media.c
Compiling util/string/casecmp_model.c
Compiling util/string/mem_media.c
Compiling util/string/mem_model.c
Compiling util/string/str_media.c
Compiling util/string/str_model.c
Compiling util/string/wcasecmp_media.c
Compiling util/string/wcasecmp_model.c
Compiling util/string/wmem_media.c
Compiling util/string/wmem_model.c
Compiling util/string/wstr_media.c
Compiling util/string/wstr_model.c
Compiling util/string/tests/casecmp_scenario.c
Compiling util/string/tests/mem_scenario.c
Compiling util/string/tests/string_main.c
Compiling util/string/tests/str_scenario.c
Compiling util/string/tests/wcasecmp_scenario.c
Compiling util/string/tests/wmem_scenario.c
Compiling util/string/tests/wstr_scenario.c
Compiling util/wordexp/wordexp_media.c
Compiling util/wordexp/wordexp_model.c
Compiling util/wordexp/tests/wordexp_main.c
Compiling util/wordexp/tests/wordexp_scenario.c
Compiling math/bessel/bessel_media.c
Compiling math/bessel/bessel_model.c
Compiling math/bessel/tests/bessel_main.c
Compiling math/bessel/tests/bessel_scenario.c
Compiling math/cexp/cexp_media.c
Compiling math/cexp/cexp_model.c
Compiling math/cexp/tests/cexp_main.c
Compiling math/cexp/tests/cexp_scenario.c
Compiling math/chyper/chyper_media.c
Compiling math/chyper/chyper_model.c
Compiling math/chyper/tests/chyper_main.c
Compiling math/chyper/tests/chyper_scenario.c
Compiling math/complex/complex_media.c
Compiling math/complex/complex_model.c
Compiling math/complex/tests/complex_main.c
Compiling math/complex/tests/complex_scenario.c
Compiling math/ctrig/ctrig_media.c
Compiling math/ctrig/ctrig_model.c
Compiling math/ctrig/tests/ctrig_main.c
Compiling math/ctrig/tests/ctrig_scenario.c
Compiling math/error/error_media.c
Compiling math/error/error_model.c
Compiling math/error/tests/error_main.c
Compiling math/error/tests/error_scenario.c
Compiling math/exp/exp_media.c
Compiling math/exp/exp_model.c
Compiling math/exp/tests/exp_main.c
Compiling math/exp/tests/exp_scenario.c
Compiling math/gamma/gamma_media.c
Compiling math/gamma/gamma_model.c
Compiling math/gamma/tests/gamma_main.c
Compiling math/gamma/tests/gamma_scenario.c
Compiling math/hyper/hyper_media.c
Compiling math/hyper/hyper_model.c
Compiling math/hyper/tests/hyper_main.c
Compiling math/hyper/tests/hyper_scenario.c
Compiling math/integer/integer_media.c
Compiling math/integer/integer_model.c
Compiling math/integer/tests/integer_main.c
Compiling math/integer/tests/integer_scenario.c
Compiling math/math/math_data.c
Compiling math/rand/rand_media.c
Compiling math/rand/rand_model.c
Compiling math/rand/tests/rand_main.c
Compiling math/rand/tests/rand_scenario.c
Compiling math/real/real_media.c
Compiling math/real/real_model.c
Compiling math/real/tests/real_main.c
Compiling math/real/tests/real_scenario.c
Compiling math/trig/trig_media.c
math/trig/trig_media.c: In function ‘convertUnifloatDouble’:
math/trig/trig_media.c:6841: warning: passing argument 2 of ‘ts_cast_spec_ref_lvalue’ from incompatible pointer type
Compiling math/trig/trig_model.c
Compiling math/trig/tests/trig_main.c
Compiling math/trig/tests/trig_scenario.c
Compiling locale/collate/collate_media.c
Compiling locale/collate/collate_model.c
Compiling locale/collate/tests/collate_main.c
Compiling locale/collate/tests/collate_scenario.c
Compiling locale/ctrans/ctrans_media.c
Compiling locale/ctrans/ctrans_model.c
Compiling locale/ctrans/tests/ctrans_main.c
Compiling locale/ctrans/tests/ctrans_scenario.c
Compiling locale/ctype/ctype_media.c
Compiling locale/ctype/ctype_model.c
Compiling locale/ctype/tests/ctype_main.c
Compiling locale/ctype/tests/ctype_scenario.c
Compiling locale/iconv/iconv_media.c
Compiling locale/iconv/iconv_model.c
Compiling locale/iconv/tests/iconv_main.c
Compiling locale/iconv/tests/iconv_scenario.c
Compiling locale/locale/locale_media.c
Compiling locale/locale/locale_model.c
locale/locale/locale_model.c: In function ‘onNewLocale’:
locale/locale/locale_model.c:27062: warning: passing argument 2 of ‘ts_cast_spec_ref_lvalue’ from incompatible pointer type
locale/locale/locale_model.c: In function ‘onDupLocale’:
locale/locale/locale_model.c:27147: warning: passing argument 2 of ‘ts_cast_spec_ref_lvalue’ from incompatible pointer type
Compiling locale/locale/tests/locale_main.c
Compiling locale/locale/tests/locale_scenario.c
Compiling locale/messages/messages_media.c
Compiling locale/messages/messages_model.c
Compiling locale/messages/tests/messages_main.c
Compiling locale/messages/tests/messages_scenario.c
Compiling locale/nlcat/nlcat_media.c
Compiling locale/nlcat/nlcat_model.c
Compiling locale/nlcat/tests/nlcat_main.c
Compiling locale/nlcat/tests/nlcat_scenario.c
Compiling locale/textdomain/textdomain_media.c
Compiling locale/textdomain/textdomain_model.c
Compiling locale/textdomain/tests/textdomain_main.c
Compiling locale/textdomain/tests/textdomain_scenario.c
Compiling locale/wcollate/wcollate_media.c
Compiling locale/wcollate/wcollate_model.c
Compiling locale/wcollate/tests/wcollate_main.c
Compiling locale/wcollate/tests/wcollate_scenario.c
Compiling locale/wctrans/wctrans_media.c
Compiling locale/wctrans/wctrans_model.c
Compiling locale/wctrans/tests/wctrans_main.c
Compiling locale/wctrans/tests/wctrans_scenario.c
Compiling locale/wctype/wctype_media.c
Compiling locale/wctype/wctype_model.c
Compiling locale/wctype/tests/wctype_main.c
Compiling locale/wctype/tests/wctype_scenario.c
Compiling signal/sigaction/sigaction_media.c
Compiling signal/sigaction/sigaction_model.c
Compiling signal/sigaction/tests/sigaction_main.c
Compiling signal/sigaction/tests/sigaction_scenario.c
signal/sigaction/tests/sigaction_scenario.c: In function ‘__sigpending_scen_call’:
signal/sigaction/tests/sigaction_scenario.c:20711: warning: passing argument 2 of ‘ts_cast_spec_ref_lvalue’ from incompatible pointer type
signal/sigaction/tests/sigaction_scenario.c:20724: warning: passing argument 2 of ‘ts_cast_spec_ref_lvalue’ from incompatible pointer type
signal/sigaction/tests/sigaction_scenario.c:20737: warning: passing argument 2 of ‘ts_cast_spec_ref_lvalue’ from incompatible pointer type
signal/sigaction/tests/sigaction_scenario.c: In function ‘__sigsuspend_scen_call’:
signal/sigaction/tests/sigaction_scenario.c:21110: warning: passing argument 2 of ‘ts_cast_spec_ref_lvalue’ from incompatible pointer type
Compiling signal/sigctrl/sigctrl_media.c
Compiling signal/sigctrl/sigctrl_model.c
Compiling signal/sigctrl/tests/sigctrl_main.c
Compiling signal/sigctrl/tests/sigctrl_scenario.c
Compiling signal/sigsend/sigsend_media.c
Compiling signal/sigsend/sigsend_model.c
Compiling signal/sigsend/tests/signal_specific_scenario.c
signal/sigsend/tests/signal_specific_scenario.c: In function ‘init_signal_specific_scenario’:
signal/sigsend/tests/signal_specific_scenario.c:20678: warning: passing argument 2 of ‘ts_cast_spec_ref_lvalue’ from incompatible pointer type
signal/sigsend/tests/signal_specific_scenario.c:20696: warning: passing argument 2 of ‘ts_cast_spec_ref_lvalue’ from incompatible pointer type
signal/sigsend/tests/signal_specific_scenario.c:20714: warning: passing argument 2 of ‘ts_cast_spec_ref_lvalue’ from incompatible pointer type
Compiling signal/sigsend/tests/sigsend_additional_scenario.c
Compiling signal/sigsend/tests/sigsend_main.c
Compiling signal/sigsend/tests/sigsend_scenario.c
signal/sigsend/tests/sigsend_scenario.c: In function ‘init_kill_and_sigaction_scenario’:
signal/sigsend/tests/sigsend_scenario.c:20293: warning: passing argument 2 of ‘ts_cast_spec_ref_lvalue’ from incompatible pointer type
Compiling signal/sigset/sigset_media.c
Compiling signal/sigset/sigset_model.c
Compiling signal/sigset/tests/sigset_automatic_scenario.c
signal/sigset/tests/sigset_automatic_scenario.c: In function ‘init_sigset_auto_scenario’:
signal/sigset/tests/sigset_automatic_scenario.c:20106: warning: passing argument 2 of ‘ts_cast_spec_ref_lvalue’ from incompatible pointer type
Compiling signal/sigset/tests/sigset_main.c
Compiling signal/sigset/tests/sigset_scenario.c
Compiling signal/sigset/tests/sigset_static_scenario.c
signal/sigset/tests/sigset_static_scenario.c: In function ‘init_sigset_scenario’:
signal/sigset/tests/sigset_static_scenario.c:20160: warning: passing argument 2 of ‘ts_cast_spec_ref_lvalue’ from incompatible pointer type
signal/sigset/tests/sigset_static_scenario.c:20182: warning: passing argument 2 of ‘ts_cast_spec_ref_lvalue’ from incompatible pointer type
signal/sigset/tests/sigset_static_scenario.c:20204: warning: passing argument 2 of ‘ts_cast_spec_ref_lvalue’ from incompatible pointer type
Compiling signal/sigstr/sigstr_media.c
Compiling signal/sigstr/sigstr_model.c
Compiling signal/sigstr/tests/sigstr_main.c
Compiling signal/sigstr/tests/sigstr_scenario.c
signal/sigstr/tests/sigstr_scenario.c: In function ‘init_signal_sigstr_basic_scenario’:
signal/sigstr/tests/sigstr_scenario.c:18120: warning: implicit declaration of function ‘initSignalToString’
Compiling signal/sigwait/sigwait_media.c
Compiling signal/sigwait/sigwait_model.c
Compiling signal/sigwait/tests/sigwait_main.c
Compiling signal/sigwait/tests/sigwait_scenario.c
signal/sigwait/tests/sigwait_scenario.c: In function ‘init_sigwait_subsystem_basic_scenario’:
signal/sigwait/tests/sigwait_scenario.c:20588: warning: passing argument 2 of ‘ts_cast_spec_ref_lvalue’ from incompatible pointer type
signal/sigwait/tests/sigwait_scenario.c:20617: warning: passing argument 2 of ‘ts_cast_spec_ref_lvalue’ from incompatible pointer type
signal/sigwait/tests/sigwait_scenario.c:20647: warning: implicit declaration of function ‘initSignalToString’
Compiling socket/netdata/netdata_media.c
Compiling socket/netdata/netdata_model.c
socket/netdata/netdata_model.c:3975: warning: initialization from incompatible pointer type
Compiling socket/netdata/tests/netdata_main.c
Compiling socket/netdata/tests/netdata_scenario.c
Compiling socket/netdb/netdb_media.c
Compiling socket/netdb/netdb_model.c
Compiling socket/netdb/tests/netdb_main.c
Compiling socket/netdb/tests/netdb_scenario.c
socket/netdb/tests/netdb_scenario.c: In function ‘__getnameinfo_netdb_scen_call’:
socket/netdb/tests/netdb_scenario.c:12278: warning: large integer implicitly truncated to unsigned type
Compiling socket/netif/netif_media.c
Compiling socket/netif/netif_model.c
Compiling socket/netif/tests/netif_main.c
Compiling socket/netif/tests/netif_scenario.c
Compiling socket/rpc/clnt_media.c
Compiling socket/rpc/clnt_model.c
Compiling socket/rpc/pmap_media.c
Compiling socket/rpc/pmap_model.c
Compiling socket/rpc/secure_media.c
Compiling socket/rpc/secure_model.c
Compiling socket/rpc/svc_media.c
Compiling socket/rpc/svc_model.c
Compiling socket/rpc/xdr_media.c
Compiling socket/rpc/xdr_model.c
Compiling socket/rpc/tests/pmap_scenario.c
Compiling socket/rpc/tests/rpc_main.c
Compiling socket/rpc/tests/secure_scenario.c
Compiling socket/rpc/tests/svc_clnt_scenario.c
Compiling socket/rpc/tests/xdr_scenario.c
Compiling socket/socket/socket_media.c
Compiling socket/socket/socket_model.c
Compiling socket/socket/tests/socket_main.c
Compiling socket/socket/tests/socket_scenario.c
Compiling time/clock/clock_media.c
Compiling time/clock/clock_model.c
Compiling time/clock/tests/clock_main.c
Compiling time/clock/tests/clock_scenario.c
Compiling time/conversion/conversion_media.c
Compiling time/conversion/conversion_model.c
Compiling time/conversion/tests/conversion_main.c
Compiling time/conversion/tests/conversion_scenario.c
Compiling time/time/time_media.c
Compiling time/time/time_model.c
time/time/time_model.c:29547: warning: return type defaults to ‘int’
Compiling time/time/tests/time_main.c
Compiling time/time/tests/time_scenario.c
Compiling time/timer/timer_media.c
Compiling time/timer/timer_model.c
Compiling time/timer/tests/timer_main.c
Compiling time/timer/tests/timer_scenario.c
Compiling ncurses/bkgd/bkgd_media.c
Compiling ncurses/bkgd/bkgd_model.c
Compiling ncurses/bkgd/tests/bkgd_main.c
Compiling ncurses/bkgd/tests/bkgd_scenario.c
Compiling ncurses/border/border_media.c
Compiling ncurses/border/border_model.c
Compiling ncurses/border/tests/border_main.c
Compiling ncurses/border/tests/border_scenario.c
Compiling ncurses/char/add_media.c
Compiling ncurses/char/add_model.c
Compiling ncurses/char/input_media.c
Compiling ncurses/char/input_model.c
Compiling ncurses/char/insert_media.c
Compiling ncurses/char/insert_model.c
Compiling ncurses/char/tests/add_scenario.c
Compiling ncurses/char/tests/char_main.c
Compiling ncurses/char/tests/input_scenario.c
Compiling ncurses/char/tests/insert_scenario.c
Compiling ncurses/chgat/chgat_media.c
Compiling ncurses/chgat/chgat_model.c
Compiling ncurses/chgat/tests/chgat_main.c
Compiling ncurses/chgat/tests/chgat_scenario.c
Compiling ncurses/chstr/add_media.c
Compiling ncurses/chstr/add_model.c
Compiling ncurses/chstr/input_media.c
Compiling ncurses/chstr/input_model.c
Compiling ncurses/chstr/tests/add_scenario.c
Compiling ncurses/chstr/tests/chstr_main.c
Compiling ncurses/chstr/tests/input_scenario.c
Compiling ncurses/clear/clear_media.c
Compiling ncurses/clear/clear_model.c
Compiling ncurses/clear/tests/clear_main.c
Compiling ncurses/clear/tests/clear_scenario.c
Compiling ncurses/color/color_media.c
Compiling ncurses/color/color_model.c
Compiling ncurses/color/tests/color_main.c
Compiling ncurses/color/tests/color_scenario.c
Compiling ncurses/input/char_media.c
Compiling ncurses/input/char_model.c
ncurses/input/char_model.c: In function ‘prePostListEquals’:
ncurses/input/char_model.c:6705: warning: integer overflow in expression
ncurses/input/char_model.c:6707: warning: integer overflow in expression
Compiling ncurses/input/input_media.c
Compiling ncurses/input/input_model.c
Compiling ncurses/input/string_media.c
Compiling ncurses/input/string_model.c
Compiling ncurses/input/timeout_media.c
Compiling ncurses/input/timeout_model.c
Compiling ncurses/input/tests/char_scenario.c
Compiling ncurses/input/tests/input_main.c
Compiling ncurses/input/tests/input_scenario.c
Compiling ncurses/input/tests/string_scenario.c
Compiling ncurses/input/tests/timeout_scenario.c
Compiling ncurses/line/line_media.c
Compiling ncurses/line/line_model.c
Compiling ncurses/line/tests/line_main.c
Compiling ncurses/line/tests/line_scenario.c
Compiling ncurses/misc/misc_media.c
Compiling ncurses/misc/misc_model.c
Compiling ncurses/misc/tests/misc_main.c
Compiling ncurses/misc/tests/misc_scenario.c
Compiling ncurses/mode/mode_media.c
Compiling ncurses/mode/mode_model.c
Compiling ncurses/mode/tests/mode_main.c
Compiling ncurses/mode/tests/mode_scenario.c
Compiling ncurses/move/move_media.c
Compiling ncurses/move/move_model.c
Compiling ncurses/move/tests/move_main.c
Compiling ncurses/move/tests/move_scenario.c
Compiling ncurses/screen/screen_media.c
Compiling ncurses/screen/screen_model.c
Compiling ncurses/screen/tests/screen_main.c
Compiling ncurses/screen/tests/screen_scenario.c
Compiling ncurses/slk/slk_media.c
Compiling ncurses/slk/slk_model.c
Compiling ncurses/slk/tests/slk_main.c
Compiling ncurses/slk/tests/slk_scenario.c
Compiling ncurses/string/add_media.c
Compiling ncurses/string/add_model.c
Compiling ncurses/string/input_media.c
Compiling ncurses/string/input_model.c
Compiling ncurses/string/insert_media.c
Compiling ncurses/string/insert_model.c
Compiling ncurses/string/printf_media.c
Compiling ncurses/string/printf_model.c
Compiling ncurses/string/scanf_media.c
Compiling ncurses/string/scanf_model.c
Compiling ncurses/string/tests/add_scenario.c
Compiling ncurses/string/tests/input_scenario.c
Compiling ncurses/string/tests/insert_scenario.c
Compiling ncurses/string/tests/printf_scenario.c
Compiling ncurses/string/tests/scanf_scenario.c
Compiling ncurses/string/tests/string_main.c
Compiling ncurses/terminal/control_media.c
Compiling ncurses/terminal/control_model.c
Compiling ncurses/terminal/termcap_media.c
Compiling ncurses/terminal/termcap_model.c
Compiling ncurses/terminal/terminal_media.c
Compiling ncurses/terminal/terminal_model.c
Compiling ncurses/terminal/terminfo_media.c
Compiling ncurses/terminal/terminfo_model.c
Compiling ncurses/terminal/tests/control_main.c
Compiling ncurses/terminal/tests/control_scenario.c
Compiling ncurses/terminal/tests/termcap_main.c
Compiling ncurses/terminal/tests/termcap_scenario.c
Compiling ncurses/terminal/tests/terminal_main.c
Compiling ncurses/terminal/tests/terminal_scenario.c
Compiling ncurses/terminal/tests/terminfo_scenario.c
Compiling ncurses/window/attr_media.c
Compiling ncurses/window/attr_model.c
Compiling ncurses/window/pad_media.c
Compiling ncurses/window/pad_model.c
Compiling ncurses/window/refresh_media.c
Compiling ncurses/window/refresh_model.c
Compiling ncurses/window/scroll_media.c
Compiling ncurses/window/scroll_model.c
Compiling ncurses/window/window_media.c
Compiling ncurses/window/window_model.c
Compiling ncurses/window/tests/attr_scenario.c
Compiling ncurses/window/tests/pad_scenario.c
Compiling ncurses/window/tests/refresh_scenario.c
Compiling ncurses/window/tests/scroll_main.c
Compiling ncurses/window/tests/scroll_scenario.c
Compiling ncurses/window/tests/window_main.c
Compiling ncurses/window/tests/window_scenario.c
Compiling ncurses/ncurses/chtypearray.c
Compiling ncurses/ncurses/ncurses_data.c
Compiling ncurses/ncurses/special_chars_scenario.c
Linking...
Build completed
make[1]: Leaving directory `/nethome/autobuild/tmp/LSBauto/olver-core-tests/package/olver-core/src/model'

Build status for handbook .............. PASSED
Build status for configuration files ... PASSED
Build status for test data ............. PASSED
Build status for olverterm ............. FAILED
Build status for agent ................. FAILED
Build status for CTesk launcher ........ PASSED
Build status for CTesk library ......... PASSED
Build status for model ................. PASSED

Build status for OLVER ................. FAILED
make: *** [lsb-test-olver-core-1.5-2.*.rpm] Error 1


More information about the lsb-messages mailing list