[Lsb-messages] Build failure for azov-qt4-tests on ppc64

lsb-autobuild at freestandards.org lsb-autobuild at freestandards.org
Fri Oct 31 03:09:10 PDT 2008


This is an automated message generated when a build failure occurs

Linux lfdev-power64 2.6.18-6-powerpc64 #1 SMP Tue Aug 19 11:59:49 UTC 2008 ppc64 ppc64 ppc64 GNU/Linux
Failed to make packages for azov-qt4-tests
bzr export  t2c_tmp_dir /nethome/autobuild/tmp/LSBauto/t2c-harness
bzr export  lsb-test-qt4-azov-1.0_tmp /nethome/autobuild/tmp/LSBauto/azov-qt4-tests
spawn rpmbuild --sign --rcfile /usr/lib/rpm/rpmrc:./rpmrc --define=_sourcedir /nethome/autobuild/tmp/LSBauto/azov-qt4-tests/LSB_Toolkit_Qt-t2c/package --define=_topdir /nethome/autobuild/tmp/rpm-build --define=_target_cpu ppc64 --define=name lsb-test-qt4-azov --define=ver 1.0 --define=rel 1 -ba lsb-test-qt4-azov.spec
Enter pass phrase: 
Pass phrase is good.
Executing(%prep): /bin/sh -e /var/tmp/rpm-tmp.90874
+ umask 022
+ cd /nethome/autobuild/tmp/rpm-build/BUILD
+ '[' '!' -x /opt/lsb/bin/lsbc++ ']'
+ cd /nethome/autobuild/tmp/rpm-build/BUILD
+ rm -rf lsb-test-qt4-azov-1.0
+ /usr/bin/gzip -dc /nethome/autobuild/tmp/LSBauto/azov-qt4-tests/LSB_Toolkit_Qt-t2c/package/lsb-test-qt4-azov-1.0.src.tgz
+ tar -xf -
+ STATUS=0
+ '[' 0 -ne 0 ']'
+ cd lsb-test-qt4-azov-1.0
+ exit 0
Executing(%build): /bin/sh -e /var/tmp/rpm-tmp.90874
+ umask 022
+ cd /nethome/autobuild/tmp/rpm-build/BUILD
+ cd lsb-test-qt4-azov-1.0
+ chmod -R +rx .
++ pwd
+ CUR_DIR=/nethome/autobuild/tmp/rpm-build/BUILD/lsb-test-qt4-azov-1.0
+ export T2C_ROOT=/nethome/autobuild/tmp/rpm-build/BUILD/lsb-test-qt4-azov-1.0/t2c_framework
+ T2C_ROOT=/nethome/autobuild/tmp/rpm-build/BUILD/lsb-test-qt4-azov-1.0/t2c_framework
+ t2c_framework/t2c/build.sh
+ cd LSB_Toolkit_Qt-t2c
+ ./build_all.sh
LSB_ROOT is /opt/lsb, LSB_LIB_DIR is /opt/lsb/lib64
TET_ROOT is /opt/lsb-tet3-lite
----------------------
Building Normal_Test-t2c
Language is CPP.
Makefile template for this test suite: $T2C_SUITE_ROOT/Normal_Test-t2c/Makefile.tmk.
Parsing file /nethome/autobuild/tmp/rpm-build/BUILD/lsb-test-qt4-azov-1.0/LSB_Toolkit_Qt-t2c/Normal_Test-t2c/src/QSessionManager/QSessionManager.t2c
make[1]: Entering directory `/nethome/autobuild/tmp/rpm-build/BUILD/lsb-test-qt4-azov-1.0/LSB_Toolkit_Qt-t2c/Normal_Test-t2c/tests'
make -C QSessionManager
make[2]: Entering directory `/nethome/autobuild/tmp/rpm-build/BUILD/lsb-test-qt4-azov-1.0/LSB_Toolkit_Qt-t2c/Normal_Test-t2c/tests/QSessionManager'
/opt/lsb/bin/qmake -project
sh /nethome/autobuild/tmp/rpm-build/BUILD/lsb-test-qt4-azov-1.0/LSB_Toolkit_Qt-t2c/chgProj.sh /nethome/autobuild/tmp/rpm-build/BUILD/lsb-test-qt4-azov-1.0/LSB_Toolkit_Qt-t2c/Normal_Test-t2c/tests/QSessionManager//QSessionManager'.pro' /nethome/autobuild/tmp/rpm-build/BUILD/lsb-test-qt4-azov-1.0/LSB_Toolkit_Qt-t2c/Normal_Test-t2c/tests/QSessionManager//QSessionManager'.cpp'
/opt/lsb/bin/qmake -o QMakefile
sh /nethome/autobuild/tmp/rpm-build/BUILD/lsb-test-qt4-azov-1.0/LSB_Toolkit_Qt-t2c/chgMake.sh /nethome/autobuild/tmp/rpm-build/BUILD/lsb-test-qt4-azov-1.0/LSB_Toolkit_Qt-t2c/Normal_Test-t2c/tests/QSessionManager//QMakefile
QTDIR=/opt/lsb make -f QMakefile
make[3]: Entering directory `/nethome/autobuild/tmp/rpm-build/BUILD/lsb-test-qt4-azov-1.0/LSB_Toolkit_Qt-t2c/Normal_Test-t2c/tests/QSessionManager'
lsbc++ -c -pipe -O2 -Wall -W -D_REENTRANT  -DT2C_IGNORE_RCAT_ERRORS -DQT_SESSIONMANAGER -DQT_THREAD_SUPPORT -DQT_SHARED -DQT_NO_DEBUG -DQT3_SUPPORT -DQT_NO_DEBUG -DQT_SVG_LIB -DQT_SQL_LIB -DQT_XML_LIB -DQT_OPENGL_LIB -DQT_GUI_LIB -DQT_NETWORK_LIB -DQT_CORE_LIB -I/opt/lsb/mkspecs/linux-lsb -I. -I/opt/lsb/include/QtCore -I/opt/lsb/include/QtCore -I/opt/lsb/include/QtNetwork -I/opt/lsb/include/QtNetwork -I/opt/lsb/include/QtGui -I/opt/lsb/include/QtGui -I/opt/lsb/include/QtOpenGL -I/opt/lsb/include/QtOpenGL -I/opt/lsb/include/QtXml -I/opt/lsb/include/QtXml -I/opt/lsb/include/QtSql -I/opt/lsb/include/QtSql -I/opt/lsb/include/QtSvg -I/opt/lsb/include/QtSvg -I/opt/lsb/include -I. -I/nethome/autobuild/tmp/rpm-build/BUILD/lsb-test-qt4-azov-1.0/LSB_Toolkit_Qt-t2c/supp_headers -I/nethome/autobuild/tmp/rpm-build/BUILD/lsb-test-qt4-azov-1.0/t2c_framework/t2c/include -I/opt/lsb-tet3-lite/inc/tet3 -I/usr/X11R6/include/X11 -I/usr/X11R6/include -I. -I. -o QSessionManager.o QSessionManager.cpp
QSessionManager.cpp:309: warning: unused parameter ‘hostname’
QSessionManager.cpp: In function ‘char* unique_filename(char*, char*)’:
QSessionManager.cpp:345: warning: ‘tempnam’ is deprecated (declared at /opt/lsb/include/stdio.h:165)
QSessionManager.cpp:345: warning: ‘tempnam’ is deprecated (declared at /opt/lsb/include/stdio.h:165)
QSessionManager.cpp: At global scope:
QSessionManager.cpp:893: warning: unused parameter ‘smsConn’
QSessionManager.cpp:893: warning: unused parameter ‘managerData’
QSessionManager.cpp:893: warning: unused parameter ‘numProps’
QSessionManager.cpp:893: warning: unused parameter ‘props’
QSessionManager.cpp:902: warning: unused parameter ‘smsConn’
QSessionManager.cpp:902: warning: unused parameter ‘managerData’
QSessionManager.cpp:902: warning: unused parameter ‘numProps’
QSessionManager.cpp:902: warning: unused parameter ‘propNames’
QSessionManager.cpp:911: warning: unused parameter ‘smsConn’
QSessionManager.cpp:911: warning: unused parameter ‘managerData’
QSessionManager.cpp:1009: warning: unused parameter ‘closure’
QSessionManager.cpp:1009: warning: unused parameter ‘id’
QSessionManager.cpp:1051: warning: unused parameter ‘sig’
QSessionManager.cpp:1057: warning: unused parameter ‘closure’
QSessionManager.cpp:1057: warning: unused parameter ‘id’
QSessionManager.cpp:1064: warning: unused parameter ‘sig’
QSessionManager.cpp:1070: warning: unused parameter ‘closure’
QSessionManager.cpp:1070: warning: unused parameter ‘id’
QSessionManager.cpp:1198: warning: unused parameter ‘source’
QSessionManager.cpp:1198: warning: unused parameter ‘id’
QSessionManager.cpp:1416: warning: unused parameter ‘smsConn’
QSessionManager.cpp:1439: warning: unused parameter ‘smsConn’
QSessionManager.cpp:1439: warning: unused parameter ‘managerData’
QSessionManager.cpp:1439: warning: unused parameter ‘cancelShutdown’
QSessionManager.cpp:1448: warning: unused parameter ‘smsConn’
QSessionManager.cpp:1448: warning: unused parameter ‘managerData’
QSessionManager.cpp:1448: warning: unused parameter ‘saveType’
QSessionManager.cpp:1448: warning: unused parameter ‘shutdown’
QSessionManager.cpp:1448: warning: unused parameter ‘interactStyle’
QSessionManager.cpp:1448: warning: unused parameter ‘fast’
QSessionManager.cpp:1448: warning: unused parameter ‘global’
QSessionManager.cpp:1456: warning: unused parameter ‘smsConn’
QSessionManager.cpp:1456: warning: unused parameter ‘managerData’
QSessionManager.cpp:1464: warning: unused parameter ‘smsConn’
QSessionManager.cpp:1464: warning: unused parameter ‘managerData’
QSessionManager.cpp:1464: warning: unused parameter ‘success’
QSessionManager.cpp:1471: warning: unused parameter ‘smsConn’
QSessionManager.cpp:1493: warning: unused parameter ‘managerData’
QSessionManager.cpp:1585: warning: unused parameter ‘source’
QSessionManager.cpp:1585: warning: unused parameter ‘id’
QSessionManager.cpp: In member function ‘virtual void QApplicationChild::saveState(QSessionManager&)’:
QSessionManager.cpp:1697: warning: dereferencing type-punned pointer will break strict-aliasing rules
QSessionManager.cpp: At global scope:
QSessionManager.cpp:1768: warning: unused parameter ‘client_data’
QSessionManager.cpp:1768: warning: unused parameter ‘id’
QSessionManager.cpp: In function ‘void test_purpose_1()’:
QSessionManager.cpp:1971: warning: label ‘purpose_finally_section_’ defined but not used
QSessionManager.cpp: In function ‘void test_purpose_2()’:
QSessionManager.cpp:2150: warning: label ‘purpose_finally_section_’ defined but not used
QSessionManager.cpp: In function ‘void test_purpose_3()’:
QSessionManager.cpp:2329: warning: label ‘purpose_finally_section_’ defined but not used
QSessionManager.cpp: In function ‘void test_purpose_4()’:
QSessionManager.cpp:2508: warning: label ‘purpose_finally_section_’ defined but not used
QSessionManager.cpp: In function ‘void test_purpose_5()’:
QSessionManager.cpp:2687: warning: label ‘purpose_finally_section_’ defined but not used
QSessionManager.cpp: In function ‘void test_purpose_6()’:
QSessionManager.cpp:2866: warning: label ‘purpose_finally_section_’ defined but not used
QSessionManager.cpp: In function ‘void test_purpose_7()’:
QSessionManager.cpp:3045: warning: label ‘purpose_finally_section_’ defined but not used
QSessionManager.cpp: In function ‘void test_purpose_8()’:
QSessionManager.cpp:3224: warning: label ‘purpose_finally_section_’ defined but not used
QSessionManager.cpp: In function ‘void test_purpose_9()’:
QSessionManager.cpp:3403: warning: label ‘purpose_finally_section_’ defined but not used
QSessionManager.cpp: In function ‘void test_purpose_10()’:
QSessionManager.cpp:3582: warning: label ‘purpose_finally_section_’ defined but not used
QSessionManager.cpp: In function ‘void test_purpose_11()’:
QSessionManager.cpp:3761: warning: label ‘purpose_finally_section_’ defined but not used
QSessionManager.cpp: In function ‘void test_purpose_12()’:
QSessionManager.cpp:3940: warning: label ‘purpose_finally_section_’ defined but not used
QSessionManager.cpp: In function ‘void test_purpose_13()’:
QSessionManager.cpp:4119: warning: label ‘purpose_finally_section_’ defined but not used
QSessionManager.cpp: In function ‘void test_purpose_14()’:
QSessionManager.cpp:4298: warning: label ‘purpose_finally_section_’ defined but not used
QSessionManager.cpp: In function ‘void test_purpose_15()’:
QSessionManager.cpp:4477: warning: label ‘purpose_finally_section_’ defined but not used
QSessionManager.cpp: In function ‘void test_purpose_16()’:
QSessionManager.cpp:4656: warning: label ‘purpose_finally_section_’ defined but not used
QSessionManager.cpp: In function ‘void test_purpose_17()’:
QSessionManager.cpp:4835: warning: label ‘purpose_finally_section_’ defined but not used
QSessionManager.cpp: In function ‘void test_purpose_18()’:
QSessionManager.cpp:5014: warning: label ‘purpose_finally_section_’ defined but not used
QSessionManager.cpp: In function ‘void test_purpose_19()’:
QSessionManager.cpp:5193: warning: label ‘purpose_finally_section_’ defined but not used
QSessionManager.cpp: In function ‘void test_purpose_20()’:
QSessionManager.cpp:5372: warning: label ‘purpose_finally_section_’ defined but not used
QSessionManager.cpp: At global scope:
QSessionManager.cpp:134: warning: ‘void user_startup()’ declared ‘static’ but never defined
lsbc++ -Wl,-rpath,/opt/lsb/lib -o QSessionManager QSessionManager.o    -L/opt/lsb-tet3-lite/lib/tet3 -L/nethome/autobuild/tmp/rpm-build/BUILD/lsb-test-qt4-azov-1.0/t2c_framework/t2c/lib -L/opt/lsb/lib -L/usr/X11R6/lib /opt/lsb-tet3-lite/lib/tet3/tcm.o /opt/lsb-tet3-lite/lib/tet3/libapi.a /nethome/autobuild/tmp/rpm-build/BUILD/lsb-test-qt4-azov-1.0/t2c_framework/t2c/lib/t2c_util.a /nethome/autobuild/tmp/rpm-build/BUILD/lsb-test-qt4-azov-1.0/t2c_framework/t2c/lib/t2c_tet_support.a -lX11 -lXt -lICE -lSM -lQtSvg -lQtSql -lQtXml -lQtOpenGL -lQtGui -lQtNetwork -lQtCore -lGLU -lGL -lpthread
make[3]: Leaving directory `/nethome/autobuild/tmp/rpm-build/BUILD/lsb-test-qt4-azov-1.0/LSB_Toolkit_Qt-t2c/Normal_Test-t2c/tests/QSessionManager'
make[2]: Leaving directory `/nethome/autobuild/tmp/rpm-build/BUILD/lsb-test-qt4-azov-1.0/LSB_Toolkit_Qt-t2c/Normal_Test-t2c/tests/QSessionManager'
make[1]: Leaving directory `/nethome/autobuild/tmp/rpm-build/BUILD/lsb-test-qt4-azov-1.0/LSB_Toolkit_Qt-t2c/Normal_Test-t2c/tests'
----------------------
Building Qt4_2D_Graphics-t2c
Language is CPP.
Makefile template for this test suite: $T2C_SUITE_ROOT/Qt4_2D_Graphics-t2c/Makefile.tmk.
Parsing file /nethome/autobuild/tmp/rpm-build/BUILD/lsb-test-qt4-azov-1.0/LSB_Toolkit_Qt-t2c/Qt4_2D_Graphics-t2c/src/QGradient/QGradient.t2c
Parsing file /nethome/autobuild/tmp/rpm-build/BUILD/lsb-test-qt4-azov-1.0/LSB_Toolkit_Qt-t2c/Qt4_2D_Graphics-t2c/src/QRectF/QRectF.t2c
Parsing file /nethome/autobuild/tmp/rpm-build/BUILD/lsb-test-qt4-azov-1.0/LSB_Toolkit_Qt-t2c/Qt4_2D_Graphics-t2c/src/QRegion/QRegion.t2c
Parsing file /nethome/autobuild/tmp/rpm-build/BUILD/lsb-test-qt4-azov-1.0/LSB_Toolkit_Qt-t2c/Qt4_2D_Graphics-t2c/src/QGraphicsSceneEvent/QGraphicsSceneEvent.t2c
Parsing file /nethome/autobuild/tmp/rpm-build/BUILD/lsb-test-qt4-azov-1.0/LSB_Toolkit_Qt-t2c/Qt4_2D_Graphics-t2c/src/QPainter/QPainter.t2c
Parsing file /nethome/autobuild/tmp/rpm-build/BUILD/lsb-test-qt4-azov-1.0/LSB_Toolkit_Qt-t2c/Qt4_2D_Graphics-t2c/src/QRadialGradient/QRadialGradient.t2c
Parsing file /nethome/autobuild/tmp/rpm-build/BUILD/lsb-test-qt4-azov-1.0/LSB_Toolkit_Qt-t2c/Qt4_2D_Graphics-t2c/src/QLinearGradient/QLinearGradient.t2c
Parsing file /nethome/autobuild/tmp/rpm-build/BUILD/lsb-test-qt4-azov-1.0/LSB_Toolkit_Qt-t2c/Qt4_2D_Graphics-t2c/src/QGraphicsSceneDragDropEvent/QGraphicsSceneDragDropEvent.t2c
Parsing file /nethome/autobuild/tmp/rpm-build/BUILD/lsb-test-qt4-azov-1.0/LSB_Toolkit_Qt-t2c/Qt4_2D_Graphics-t2c/src/QIcon/QIcon.t2c
Parsing file /nethome/autobuild/tmp/rpm-build/BUILD/lsb-test-qt4-azov-1.0/LSB_Toolkit_Qt-t2c/Qt4_2D_Graphics-t2c/src/QGraphicsView/QGraphicsView.t2c
Parsing file /nethome/autobuild/tmp/rpm-build/BUILD/lsb-test-qt4-azov-1.0/LSB_Toolkit_Qt-t2c/Qt4_2D_Graphics-t2c/src/QMatrix/QMatrix.t2c
Parsing file /nethome/autobuild/tmp/rpm-build/BUILD/lsb-test-qt4-azov-1.0/LSB_Toolkit_Qt-t2c/Qt4_2D_Graphics-t2c/src/QGraphicsSceneHelpEvent/QGraphicsSceneHelpEvent.t2c
Parsing file /nethome/autobuild/tmp/rpm-build/BUILD/lsb-test-qt4-azov-1.0/LSB_Toolkit_Qt-t2c/Qt4_2D_Graphics-t2c/src/QGraphicsItemAnimation/QGraphicsItemAnimation.t2c
Parsing file /nethome/autobuild/tmp/rpm-build/BUILD/lsb-test-qt4-azov-1.0/LSB_Toolkit_Qt-t2c/Qt4_2D_Graphics-t2c/src/QPolygonF/QPolygonF.t2c
Parsing file /nethome/autobuild/tmp/rpm-build/BUILD/lsb-test-qt4-azov-1.0/LSB_Toolkit_Qt-t2c/Qt4_2D_Graphics-t2c/src/QIconEngine/QIconEngine.t2c
Parsing file /nethome/autobuild/tmp/rpm-build/BUILD/lsb-test-qt4-azov-1.0/LSB_Toolkit_Qt-t2c/Qt4_2D_Graphics-t2c/src/QGraphicsItem/QGraphicsItem.t2c
Parsing file /nethome/autobuild/tmp/rpm-build/BUILD/lsb-test-qt4-azov-1.0/LSB_Toolkit_Qt-t2c/Qt4_2D_Graphics-t2c/src/QGraphicsItemGroup/QGraphicsItemGroup.t2c
Parsing file /nethome/autobuild/tmp/rpm-build/BUILD/lsb-test-qt4-azov-1.0/LSB_Toolkit_Qt-t2c/Qt4_2D_Graphics-t2c/src/QGraphicsSceneHoverEvent/QGraphicsSceneHoverEvent.t2c
Parsing file /nethome/autobuild/tmp/rpm-build/BUILD/lsb-test-qt4-azov-1.0/LSB_Toolkit_Qt-t2c/Qt4_2D_Graphics-t2c/src/QGraphicsSimpleTextItem/QGraphicsSimpleTextItem.t2c
Parsing file /nethome/autobuild/tmp/rpm-build/BUILD/lsb-test-qt4-azov-1.0/LSB_Toolkit_Qt-t2c/Qt4_2D_Graphics-t2c/src/QGraphicsRectItem/QGraphicsRectItem.t2c
Parsing file /nethome/autobuild/tmp/rpm-build/BUILD/lsb-test-qt4-azov-1.0/LSB_Toolkit_Qt-t2c/Qt4_2D_Graphics-t2c/src/QGraphicsPolygonItem/QGraphicsPolygonItem.t2c
Parsing file /nethome/autobuild/tmp/rpm-build/BUILD/lsb-test-qt4-azov-1.0/LSB_Toolkit_Qt-t2c/Qt4_2D_Graphics-t2c/src/QPainterPathStroker/QPainterPathStroker.t2c
Parsing file /nethome/autobuild/tmp/rpm-build/BUILD/lsb-test-qt4-azov-1.0/LSB_Toolkit_Qt-t2c/Qt4_2D_Graphics-t2c/src/QPoint/QPoint.t2c
Parsing file /nethome/autobuild/tmp/rpm-build/BUILD/lsb-test-qt4-azov-1.0/LSB_Toolkit_Qt-t2c/Qt4_2D_Graphics-t2c/src/QGraphicsLineItem/QGraphicsLineItem.t2c
Parsing file /nethome/autobuild/tmp/rpm-build/BUILD/lsb-test-qt4-azov-1.0/LSB_Toolkit_Qt-t2c/Qt4_2D_Graphics-t2c/src/QPen/QPen.t2c
Parsing file /nethome/autobuild/tmp/rpm-build/BUILD/lsb-test-qt4-azov-1.0/LSB_Toolkit_Qt-t2c/Qt4_2D_Graphics-t2c/src/QGraphicsSceneWheelEvent/QGraphicsSceneWheelEvent.t2c
Parsing file /nethome/autobuild/tmp/rpm-build/BUILD/lsb-test-qt4-azov-1.0/LSB_Toolkit_Qt-t2c/Qt4_2D_Graphics-t2c/src/QGraphicsScene/QGraphicsScene.t2c
Parsing file /nethome/autobuild/tmp/rpm-build/BUILD/lsb-test-qt4-azov-1.0/LSB_Toolkit_Qt-t2c/Qt4_2D_Graphics-t2c/src/QPaintEngine/QPaintEngine.t2c
Parsing file /nethome/autobuild/tmp/rpm-build/BUILD/lsb-test-qt4-azov-1.0/LSB_Toolkit_Qt-t2c/Qt4_2D_Graphics-t2c/src/QBrush/QBrush.t2c
Parsing file /nethome/autobuild/tmp/rpm-build/BUILD/lsb-test-qt4-azov-1.0/LSB_Toolkit_Qt-t2c/Qt4_2D_Graphics-t2c/src/QPainterPath/QPainterPath.t2c
Parsing file /nethome/autobuild/tmp/rpm-build/BUILD/lsb-test-qt4-azov-1.0/LSB_Toolkit_Qt-t2c/Qt4_2D_Graphics-t2c/src/QSize/QSize.t2c
Parsing file /nethome/autobuild/tmp/rpm-build/BUILD/lsb-test-qt4-azov-1.0/LSB_Toolkit_Qt-t2c/Qt4_2D_Graphics-t2c/src/QGraphicsSceneMouseEvent/QGraphicsSceneMouseEvent.t2c
Parsing file /nethome/autobuild/tmp/rpm-build/BUILD/lsb-test-qt4-azov-1.0/LSB_Toolkit_Qt-t2c/Qt4_2D_Graphics-t2c/src/QSizeF/QSizeF.t2c
Parsing file /nethome/autobuild/tmp/rpm-build/BUILD/lsb-test-qt4-azov-1.0/LSB_Toolkit_Qt-t2c/Qt4_2D_Graphics-t2c/src/QGraphicsEllipseItem/QGraphicsEllipseItem.t2c
Parsing file /nethome/autobuild/tmp/rpm-build/BUILD/lsb-test-qt4-azov-1.0/LSB_Toolkit_Qt-t2c/Qt4_2D_Graphics-t2c/src/QGraphicsPixmapItem/QGraphicsPixmapItem.t2c
Parsing file /nethome/autobuild/tmp/rpm-build/BUILD/lsb-test-qt4-azov-1.0/LSB_Toolkit_Qt-t2c/Qt4_2D_Graphics-t2c/src/QGraphicsTextItem/QGraphicsTextItem.t2c
Parsing file /nethome/autobuild/tmp/rpm-build/BUILD/lsb-test-qt4-azov-1.0/LSB_Toolkit_Qt-t2c/Qt4_2D_Graphics-t2c/src/QGraphicsPathItem/QGraphicsPathItem.t2c
Parsing file /nethome/autobuild/tmp/rpm-build/BUILD/lsb-test-qt4-azov-1.0/LSB_Toolkit_Qt-t2c/Qt4_2D_Graphics-t2c/src/QPolygon/QPolygon.t2c
Parsing file /nethome/autobuild/tmp/rpm-build/BUILD/lsb-test-qt4-azov-1.0/LSB_Toolkit_Qt-t2c/Qt4_2D_Graphics-t2c/src/QPaintEngineState/QPaintEngineState.t2c
Parsing file /nethome/autobuild/tmp/rpm-build/BUILD/lsb-test-qt4-azov-1.0/LSB_Toolkit_Qt-t2c/Qt4_2D_Graphics-t2c/src/QGraphicsSceneContextMenuEvent/QGraphicsSceneContextMenuEvent.t2c
Parsing file /nethome/autobuild/tmp/rpm-build/BUILD/lsb-test-qt4-azov-1.0/LSB_Toolkit_Qt-t2c/Qt4_2D_Graphics-t2c/src/QLineF/QLineF.t2c
Parsing file /nethome/autobuild/tmp/rpm-build/BUILD/lsb-test-qt4-azov-1.0/LSB_Toolkit_Qt-t2c/Qt4_2D_Graphics-t2c/src/QRect/QRect.t2c
Parsing file /nethome/autobuild/tmp/rpm-build/BUILD/lsb-test-qt4-azov-1.0/LSB_Toolkit_Qt-t2c/Qt4_2D_Graphics-t2c/src/QConicalGradient/QConicalGradient.t2c
make[1]: Entering directory `/nethome/autobuild/tmp/rpm-build/BUILD/lsb-test-qt4-azov-1.0/LSB_Toolkit_Qt-t2c/Qt4_2D_Graphics-t2c/tests'
make -C QBrush
make[2]: Entering directory `/nethome/autobuild/tmp/rpm-build/BUILD/lsb-test-qt4-azov-1.0/LSB_Toolkit_Qt-t2c/Qt4_2D_Graphics-t2c/tests/QBrush'
/opt/lsb/bin/qmake -project
sh /nethome/autobuild/tmp/rpm-build/BUILD/lsb-test-qt4-azov-1.0/LSB_Toolkit_Qt-t2c/chgProj.sh /nethome/autobuild/tmp/rpm-build/BUILD/lsb-test-qt4-azov-1.0/LSB_Toolkit_Qt-t2c/Qt4_2D_Graphics-t2c/tests/QBrush//QBrush'.pro' /nethome/autobuild/tmp/rpm-build/BUILD/lsb-test-qt4-azov-1.0/LSB_Toolkit_Qt-t2c/Qt4_2D_Graphics-t2c/tests/QBrush//QBrush'.cpp'
/opt/lsb/bin/qmake -o QMakefile
sh /nethome/autobuild/tmp/rpm-build/BUILD/lsb-test-qt4-azov-1.0/LSB_Toolkit_Qt-t2c/chgMake.sh /nethome/autobuild/tmp/rpm-build/BUILD/lsb-test-qt4-azov-1.0/LSB_Toolkit_Qt-t2c/Qt4_2D_Graphics-t2c/tests/QBrush//QMakefile
QTDIR=/opt/lsb make -f QMakefile
make[3]: Entering directory `/nethome/autobuild/tmp/rpm-build/BUILD/lsb-test-qt4-azov-1.0/LSB_Toolkit_Qt-t2c/Qt4_2D_Graphics-t2c/tests/QBrush'
lsbc++ -c -pipe -O2 -Wall -W -D_REENTRANT  -DT2C_IGNORE_RCAT_ERRORS -DQT_SESSIONMANAGER -DQT_THREAD_SUPPORT -DQT_SHARED -DQT_NO_DEBUG -DQT3_SUPPORT -DQT_NO_DEBUG -DQT_SVG_LIB -DQT_SQL_LIB -DQT_XML_LIB -DQT_OPENGL_LIB -DQT_GUI_LIB -DQT_NETWORK_LIB -DQT_CORE_LIB -I/opt/lsb/mkspecs/linux-lsb -I. -I/opt/lsb/include/QtCore -I/opt/lsb/include/QtCore -I/opt/lsb/include/QtNetwork -I/opt/lsb/include/QtNetwork -I/opt/lsb/include/QtGui -I/opt/lsb/include/QtGui -I/opt/lsb/include/QtOpenGL -I/opt/lsb/include/QtOpenGL -I/opt/lsb/include/QtXml -I/opt/lsb/include/QtXml -I/opt/lsb/include/QtSql -I/opt/lsb/include/QtSql -I/opt/lsb/include/QtSvg -I/opt/lsb/include/QtSvg -I/opt/lsb/include -I. -I/nethome/autobuild/tmp/rpm-build/BUILD/lsb-test-qt4-azov-1.0/LSB_Toolkit_Qt-t2c/supp_headers -I/nethome/autobuild/tmp/rpm-build/BUILD/lsb-test-qt4-azov-1.0/t2c_framework/t2c/include -I/opt/lsb-tet3-lite/inc/tet3 -I/usr/X11R6/include -I. -I. -o QBrush.o QBrush.cpp
/opt/lsb/include/c++/bits/stl_tree.h:397: error: ‘__is_pod’ is not a member of ‘std’
/opt/lsb/include/c++/bits/stl_tree.h:397: error: expected primary-expression before ‘>’ token
/opt/lsb/include/c++/bits/stl_tree.h:397: error: expected constructor, destructor, or type conversion before ‘>’ token
/opt/lsb/include/c++/bits/stl_tree.h:419: error: ‘_Rb_tree_impl’ is not a template
QBrush.cpp: In function ‘void test_purpose_2()’:
QBrush.cpp:432: warning: label ‘purpose_finally_section_’ defined but not used
QBrush.cpp: In function ‘void test_purpose_3()’:
QBrush.cpp:487: warning: label ‘purpose_finally_section_’ defined but not used
QBrush.cpp: In function ‘void test_purpose_4()’:
QBrush.cpp:545: warning: label ‘purpose_finally_section_’ defined but not used
QBrush.cpp: In function ‘void test_purpose_5()’:
QBrush.cpp:601: warning: label ‘purpose_finally_section_’ defined but not used
QBrush.cpp: In function ‘void test_purpose_6()’:
QBrush.cpp:656: warning: label ‘purpose_finally_section_’ defined but not used
QBrush.cpp: In function ‘void test_purpose_7()’:
QBrush.cpp:709: warning: label ‘purpose_finally_section_’ defined but not used
QBrush.cpp: In function ‘void test_purpose_8()’:
QBrush.cpp:772: warning: label ‘purpose_finally_section_’ defined but not used
QBrush.cpp: In function ‘void test_purpose_9()’:
QBrush.cpp:827: warning: label ‘purpose_finally_section_’ defined but not used
QBrush.cpp: In function ‘void test_purpose_10()’:
QBrush.cpp:885: warning: label ‘purpose_finally_section_’ defined but not used
QBrush.cpp: In function ‘void test_purpose_11()’:
QBrush.cpp:939: warning: label ‘purpose_finally_section_’ defined but not used
QBrush.cpp: In function ‘void test_purpose_12()’:
QBrush.cpp:991: warning: label ‘purpose_finally_section_’ defined but not used
QBrush.cpp: In function ‘void test_purpose_13()’:
QBrush.cpp:1052: warning: label ‘purpose_finally_section_’ defined but not used
QBrush.cpp: In function ‘void test_purpose_14()’:
QBrush.cpp:1106: warning: label ‘purpose_finally_section_’ defined but not used
QBrush.cpp: In function ‘void test_purpose_15()’:
QBrush.cpp:1163: warning: label ‘purpose_finally_section_’ defined but not used
QBrush.cpp: In function ‘void test_purpose_16()’:
QBrush.cpp:1222: warning: label ‘purpose_finally_section_’ defined but not used
QBrush.cpp: In function ‘void test_purpose_17()’:
QBrush.cpp:1273: warning: label ‘purpose_finally_section_’ defined but not used
QBrush.cpp: In function ‘void test_purpose_18()’:
QBrush.cpp:1327: warning: label ‘purpose_finally_section_’ defined but not used
QBrush.cpp: In function ‘void test_purpose_19()’:
QBrush.cpp:1390: warning: label ‘purpose_finally_section_’ defined but not used
QBrush.cpp: In function ‘void test_purpose_20()’:
QBrush.cpp:1455: warning: label ‘purpose_finally_section_’ defined but not used
QBrush.cpp: In function ‘void test_purpose_21()’:
QBrush.cpp:1510: warning: label ‘purpose_finally_section_’ defined but not used
QBrush.cpp: In function ‘void test_purpose_23()’:
QBrush.cpp:1629: warning: label ‘purpose_finally_section_’ defined but not used
QBrush.cpp: In function ‘void test_purpose_25()’:
QBrush.cpp:1755: warning: label ‘purpose_finally_section_’ defined but not used
QBrush.cpp: In function ‘void test_purpose_26()’:
QBrush.cpp:1809: warning: label ‘purpose_finally_section_’ defined but not used
QBrush.cpp: In function ‘void test_purpose_27()’:
QBrush.cpp:1863: warning: label ‘purpose_finally_section_’ defined but not used
QBrush.cpp: In function ‘void test_purpose_28()’:
QBrush.cpp:1928: warning: label ‘purpose_finally_section_’ defined but not used
QBrush.cpp: In function ‘void test_purpose_29()’:
QBrush.cpp:1983: warning: label ‘purpose_finally_section_’ defined but not used
QBrush.cpp: In function ‘void test_purpose_30()’:
QBrush.cpp:2038: warning: label ‘purpose_finally_section_’ defined but not used
QBrush.cpp: In function ‘void test_purpose_31()’:
QBrush.cpp:2090: warning: label ‘purpose_finally_section_’ defined but not used
QBrush.cpp: In function ‘void test_purpose_32()’:
QBrush.cpp:2149: warning: label ‘purpose_finally_section_’ defined but not used
QBrush.cpp: In function ‘void test_purpose_33()’:
QBrush.cpp:2207: warning: label ‘purpose_finally_section_’ defined but not used
QBrush.cpp: In function ‘void test_purpose_35()’:
QBrush.cpp:2323: warning: label ‘purpose_finally_section_’ defined but not used
QBrush.cpp: At global scope:
QBrush.cpp:134: warning: ‘void user_startup()’ declared ‘static’ but never defined
make[3]: *** [QBrush.o] Error 1
make[3]: Leaving directory `/nethome/autobuild/tmp/rpm-build/BUILD/lsb-test-qt4-azov-1.0/LSB_Toolkit_Qt-t2c/Qt4_2D_Graphics-t2c/tests/QBrush'
make[2]: *** [all] Error 2
make[2]: Leaving directory `/nethome/autobuild/tmp/rpm-build/BUILD/lsb-test-qt4-azov-1.0/LSB_Toolkit_Qt-t2c/Qt4_2D_Graphics-t2c/tests/QBrush'
make[1]: *** [QBrush] Error 2
make[1]: Leaving directory `/nethome/autobuild/tmp/rpm-build/BUILD/lsb-test-qt4-azov-1.0/LSB_Toolkit_Qt-t2c/Qt4_2D_Graphics-t2c/tests'
Failed to build tests for Qt4_2D_Graphics-t2c, aborting...
error: Bad exit status from /var/tmp/rpm-tmp.90874 (%build)


RPM build errors:
    Bad exit status from /var/tmp/rpm-tmp.90874 (%build)
expect: spawn id exp3 not open
    while executing
"expect "exit 0""
send: spawn id exp3 not open
    while executing
"send "\n""
mv: cannot stat `/nethome/autobuild/tmp/rpm-build/SRPMS/lsb-test-qt4-azov-1.0-1.src.rpm': No such file or directory
make: *** [lsb-test-qt4-azov-1.0-1.ppc64.rpm] Error 1


More information about the lsb-messages mailing list