[Lsb-messages] Build failure for lsbdev-base on ppc

lsb-autobuild at freestandards.org lsb-autobuild at freestandards.org
Mon Apr 27 00:30:02 PDT 2009


This is an automated message generated when a build failure occurs

Linux lfdev-power64 2.6.18-6-powerpc64 #1 SMP Fri Oct 17 05:02:45 UTC 2008 ppc ppc ppc GNU/Linux
Failed to make packages for lsbdev-base
if test ! -e .need_config_update || test 4.0.0-4 != `cat .need_config_update`; \
  then echo 4.0.0-4 > .need_config_update; \
fi
sed -e "s#@LSBVERSION@#`echo 4.0.0`#" -e "s#@PACKAGE_RELEASE@#`echo 4`#" -e "s#@TRUELSBVERSION@#`echo 4.0`#" < lsb-build-base.spec.sed > lsb-build-base.spec
if [ -e /nethome/autobuild/tmp/lsb-build-base-4.0.0 ]; then rm -rf /nethome/autobuild/tmp/lsb-build-base-4.0.0; fi
bzr export --revision=-1 /nethome/autobuild/tmp/lsb-build-base-4.0.0 http://bzr.linux-foundation.org/lsb/devel/build_env
cp -pr README Licence /nethome/autobuild/tmp/lsb-build-base-4.0.0
grep LIB64 ../Makefile.common > /nethome/autobuild/tmp/lsb-build-base-4.0.0/Makefile
cat Makefile.build >> /nethome/autobuild/tmp/lsb-build-base-4.0.0/Makefile
echo "FULL_PACKAGE_NAME=lsb-build-base-4.0.0"
FULL_PACKAGE_NAME=lsb-build-base-4.0.0
cd /nethome/autobuild/tmp/lsb-build-base-4.0.0/.. && \
tar -cz lsb-build-base-4.0.0 > /nethome/autobuild/tmp/lsb_autobuild.12999/packaging/lsbdev-base/lsb-build-base-4.0.0.tar.gz && \
rm -rf /nethome/autobuild/tmp/lsb-build-base-4.0.0
spawn rpmbuild --sign --rcfile /usr/lib/rpm/rpmrc:../rpmrc --define=_sourcedir /nethome/autobuild/tmp/lsb_autobuild.12999/packaging/lsbdev-base --define=buildroot /nethome/autobuild/tmp/lsb-build-base-4.0.0 --define=_topdir /nethome/autobuild/tmp/rpm-build --define=_target_cpu ppc -ba lsb-build-base.spec
Enter pass phrase: 
Pass phrase is good.
Executing(%prep): /bin/sh -e /var/tmp/rpm-tmp.59008
+ umask 022
+ cd /nethome/autobuild/tmp/rpm-build/BUILD
+ cd /nethome/autobuild/tmp/rpm-build/BUILD
+ rm -rf lsb-build-base-4.0.0
+ /usr/bin/gzip -dc /nethome/autobuild/tmp/lsb_autobuild.12999/packaging/lsbdev-base/lsb-build-base-4.0.0.tar.gz
+ tar -xf -
+ STATUS=0
+ '[' 0 -ne 0 ']'
+ cd lsb-build-base-4.0.0
+ exit 0
Executing(%build): /bin/sh -e /var/tmp/rpm-tmp.92181
+ umask 022
+ cd /nethome/autobuild/tmp/rpm-build/BUILD
+ cd lsb-build-base-4.0.0
+ make LSBVERSION=4.0.0 LSBLIBCHK_VERSION=4.0.0-4
make[1]: Entering directory `/nethome/autobuild/tmp/rpm-build/BUILD/lsb-build-base-4.0.0'
cd stub_libs && make 
make[2]: Entering directory `/nethome/autobuild/tmp/rpm-build/BUILD/lsb-build-base-4.0.0/stub_libs'
for version in 3.0 3.1 3.2 4.0; do ( cd $version/`case \`uname -m\` in i686|i586|i486|i386|athlon) echo IA32; ;; ia64) echo IA64; ;; ppc) echo PPC32; ;; ppc64) echo PPC64; ;; s390) echo S390; ;; s390x) echo S390X; ;; x86_64) echo x86-64; ;; *) echo Unknown; esac` && make core-libs ); done
make[3]: Entering directory `/nethome/autobuild/tmp/rpm-build/BUILD/lsb-build-base-4.0.0/stub_libs/3.0/PPC32'
cc -g -Wall  -fno-builtin -fPIC   -c -o libICE.o libICE.c
cc -g -Wall  -fno-builtin -fPIC   -c -o libGL.o libGL.c
cc -g -Wall  -fno-builtin -fPIC   -c -o libm.o libm.c
cc -g -Wall  -fno-builtin -fPIC   -c -o libc.o libc.c
cc -g -Wall  -fno-builtin -fPIC   -c -o libSM.o libSM.c
cc -g -Wall  -fno-builtin -fPIC   -c -o libX11.o libX11.c
cc -g -Wall  -fno-builtin -fPIC   -c -o libXext.o libXext.c
cc -g -Wall  -fno-builtin -fPIC   -c -o libXt.o libXt.c
/tmp/ccG5AOSI.s: Assembler messages:
/tmp/ccG5AOSI.s:5774: Error: missing expression in .size directive
make[3]: *** [libXt.o] Error 1
make[3]: Leaving directory `/nethome/autobuild/tmp/rpm-build/BUILD/lsb-build-base-4.0.0/stub_libs/3.0/PPC32'
make[3]: Entering directory `/nethome/autobuild/tmp/rpm-build/BUILD/lsb-build-base-4.0.0/stub_libs/3.1/PPC32'
cc -g -Wall  -fno-builtin -fPIC   -c -o libICE.o libICE.c
cc -g -Wall  -fno-builtin -fPIC   -c -o libGL.o libGL.c
cc -g -Wall  -fno-builtin -fPIC   -c -o libm.o libm.c
cc -g -Wall  -fno-builtin -fPIC   -c -o libc.o libc.c
cc -g -Wall  -fno-builtin -fPIC   -c -o libSM.o libSM.c
cc -g -Wall  -fno-builtin -fPIC   -c -o libX11.o libX11.c
cc -g -Wall  -fno-builtin -fPIC   -c -o libXext.o libXext.c
cc -g -Wall  -fno-builtin -fPIC   -c -o libXt.o libXt.c
/tmp/ccbb1rqY.s: Assembler messages:
/tmp/ccbb1rqY.s:5774: Error: missing expression in .size directive
make[3]: *** [libXt.o] Error 1
make[3]: Leaving directory `/nethome/autobuild/tmp/rpm-build/BUILD/lsb-build-base-4.0.0/stub_libs/3.1/PPC32'
make[3]: Entering directory `/nethome/autobuild/tmp/rpm-build/BUILD/lsb-build-base-4.0.0/stub_libs/3.2/PPC32'
cc -g -Wall  -fno-builtin -fPIC   -c -o libICE.o libICE.c
cc -g -Wall  -fno-builtin -fPIC   -c -o libGL.o libGL.c
cc -g -Wall  -fno-builtin -fPIC   -c -o libm.o libm.c
cc -g -Wall  -fno-builtin -fPIC   -c -o libc.o libc.c
cc -g -Wall  -fno-builtin -fPIC   -c -o libSM.o libSM.c
cc -g -Wall  -fno-builtin -fPIC   -c -o libX11.o libX11.c
cc -g -Wall  -fno-builtin -fPIC   -c -o libXext.o libXext.c
cc -g -Wall  -fno-builtin -fPIC   -c -o libXt.o libXt.c
/tmp/ccdMAyni.s: Assembler messages:
/tmp/ccdMAyni.s:5774: Error: missing expression in .size directive
make[3]: *** [libXt.o] Error 1
make[3]: Leaving directory `/nethome/autobuild/tmp/rpm-build/BUILD/lsb-build-base-4.0.0/stub_libs/3.2/PPC32'
make[3]: Entering directory `/nethome/autobuild/tmp/rpm-build/BUILD/lsb-build-base-4.0.0/stub_libs/4.0/PPC32'
cc -g -Wall  -fno-builtin -fPIC   -c -o libICE.o libICE.c
cc -g -Wall  -fno-builtin -fPIC   -c -o libGL.o libGL.c
cc -g -Wall  -fno-builtin -fPIC   -c -o libm.o libm.c
cc -g -Wall  -fno-builtin -fPIC   -c -o libc.o libc.c
cc -g -Wall  -fno-builtin -fPIC   -c -o libSM.o libSM.c
cc -g -Wall  -fno-builtin -fPIC   -c -o libX11.o libX11.c
cc -g -Wall  -fno-builtin -fPIC   -c -o libXext.o libXext.c
cc -g -Wall  -fno-builtin -fPIC   -c -o libXt.o libXt.c
/tmp/ccl3a2az.s: Assembler messages:
/tmp/ccl3a2az.s:5774: Error: missing expression in .size directive
make[3]: *** [libXt.o] Error 1
make[3]: Leaving directory `/nethome/autobuild/tmp/rpm-build/BUILD/lsb-build-base-4.0.0/stub_libs/4.0/PPC32'
make[2]: *** [core-libs] Error 2
make[2]: Leaving directory `/nethome/autobuild/tmp/rpm-build/BUILD/lsb-build-base-4.0.0/stub_libs'
make[1]: *** [all] Error 2
make[1]: Leaving directory `/nethome/autobuild/tmp/rpm-build/BUILD/lsb-build-base-4.0.0'
error: Bad exit status from /var/tmp/rpm-tmp.92181 (%build)


RPM build errors:
    Bad exit status from /var/tmp/rpm-tmp.92181 (%build)
expect: spawn id exp3 not open
    while executing
"expect "exit 0""
send: spawn id exp3 not open
    while executing
"send "\n""
mv: cannot stat `/nethome/autobuild/tmp/rpm-build/RPMS/ppc/lsb-build-base-4.0.0-4.ppc.rpm': No such file or directory
make: *** [lsb-build-base-4.0.0-4.ppc.rpm] Error 1


More information about the lsb-messages mailing list