[Lsb-messages] Build failure for azov-qt3-tests on ia64

lsb-autobuild at freestandards.org lsb-autobuild at freestandards.org
Mon Apr 27 03:14:41 PDT 2009


This is an automated message generated when a build failure occurs

Linux fsgdev-ia64 2.6.18-6-mckinley #1 SMP Mon Feb 11 11:47:35 UTC 2008 ia64 ia64 ia64 GNU/Linux
Failed to make packages for azov-qt3-tests
sed -e "s#@NAME@#`echo lsb-test-qt3-azov`#" -e "s#@VERSION@#`echo 4.0.0`#" -e "s#@RELEASE@#`echo 4`#" < lsb-test-qt3-azov.spec.sed > lsb-test-qt3-azov.spec
bzr export --revision=-1 t2c_tmp_dir /nethome/autobuild/tmp/LSBauto/t2c-harness
bzr export --revision=-1 lsb-test-qt3-azov-4.0.0_tmp /nethome/autobuild/tmp/LSBauto/azov-qt3-tests
spawn rpmbuild --sign --rcfile /usr/lib/rpm/rpmrc:./rpmrc --define=_sourcedir /nethome/autobuild/tmp/LSBauto/azov-qt3-tests/libqt-mt-t2c/package --define=_topdir /nethome/autobuild/tmp/rpm-build --define=_target_cpu ia64 -ba lsb-test-qt3-azov.spec
Enter pass phrase: 
Pass phrase is good.
Executing(%prep): /bin/sh -e /var/tmp/rpm-tmp.27308
+ umask 022
+ cd /nethome/autobuild/tmp/rpm-build/BUILD
+ '[' '!' -x /opt/lsb/bin/lsbc++ ']'
+ cd /nethome/autobuild/tmp/rpm-build/BUILD
+ rm -rf lsb-test-qt3-azov-4.0.0
+ /usr/bin/gzip -dc /nethome/autobuild/tmp/LSBauto/azov-qt3-tests/libqt-mt-t2c/package/lsb-test-qt3-azov-4.0.0.src.tgz
+ tar -xf -
+ STATUS=0
+ '[' 0 -ne 0 ']'
+ cd lsb-test-qt3-azov-4.0.0
+ exit 0
Executing(%build): /bin/sh -e /var/tmp/rpm-tmp.35761
+ umask 022
+ cd /nethome/autobuild/tmp/rpm-build/BUILD
+ cd lsb-test-qt3-azov-4.0.0
+ chmod -R +rx .
++ pwd
+ CUR_DIR=/nethome/autobuild/tmp/rpm-build/BUILD/lsb-test-qt3-azov-4.0.0
+ export T2C_ROOT=/nethome/autobuild/tmp/rpm-build/BUILD/lsb-test-qt3-azov-4.0.0/t2c_framework
+ T2C_ROOT=/nethome/autobuild/tmp/rpm-build/BUILD/lsb-test-qt3-azov-4.0.0/t2c_framework
+ t2c_framework/t2c/build.sh
+ cd libqt-mt-t2c
+ ./build_all.sh
LSB_ROOT is /opt/lsb, LSB_LIB_DIR is /opt/lsb/lib
TET_ROOT is /opt/lsb-tet3-lite
----------------------
Building Normal_Test-t2c
Language is CPP.
Makefile template for this test suite: $T2C_SUITE_ROOT/Normal_Test-t2c/Makefile.tmk.
Parsing file /nethome/autobuild/tmp/rpm-build/BUILD/lsb-test-qt3-azov-4.0.0/libqt-mt-t2c/Normal_Test-t2c/src/QGLWidget/QGLWidget.t2c
Parsing file /nethome/autobuild/tmp/rpm-build/BUILD/lsb-test-qt3-azov-4.0.0/libqt-mt-t2c/Normal_Test-t2c/src/QGLContext/QGLContext.t2c
Parsing file /nethome/autobuild/tmp/rpm-build/BUILD/lsb-test-qt3-azov-4.0.0/libqt-mt-t2c/Normal_Test-t2c/src/Qt3 Functions/Functions.t2c
Parsing file /nethome/autobuild/tmp/rpm-build/BUILD/lsb-test-qt3-azov-4.0.0/libqt-mt-t2c/Normal_Test-t2c/src/QSessionManager/QSessionManager.t2c
Parsing file /nethome/autobuild/tmp/rpm-build/BUILD/lsb-test-qt3-azov-4.0.0/libqt-mt-t2c/Normal_Test-t2c/src/QButtonGroup/QButtonGroup.t2c
Parsing file /nethome/autobuild/tmp/rpm-build/BUILD/lsb-test-qt3-azov-4.0.0/libqt-mt-t2c/Normal_Test-t2c/src/QIconView/QIconView.t2c
make[1]: Entering directory `/nethome/autobuild/tmp/rpm-build/BUILD/lsb-test-qt3-azov-4.0.0/libqt-mt-t2c/Normal_Test-t2c/tests'
make -C Functions
make[2]: Entering directory `/nethome/autobuild/tmp/rpm-build/BUILD/lsb-test-qt3-azov-4.0.0/libqt-mt-t2c/Normal_Test-t2c/tests/Functions'
/opt/lsb/bin/qmake -project
sh /nethome/autobuild/tmp/rpm-build/BUILD/lsb-test-qt3-azov-4.0.0/libqt-mt-t2c/chgProj.sh /nethome/autobuild/tmp/rpm-build/BUILD/lsb-test-qt3-azov-4.0.0/libqt-mt-t2c/Normal_Test-t2c/tests/Functions//Functions'.pro' /nethome/autobuild/tmp/rpm-build/BUILD/lsb-test-qt3-azov-4.0.0/libqt-mt-t2c/Normal_Test-t2c/tests/Functions//Functions'.cpp'
/opt/lsb/bin/qmake -o QMakefile
sh /nethome/autobuild/tmp/rpm-build/BUILD/lsb-test-qt3-azov-4.0.0/libqt-mt-t2c/chgMake.sh /nethome/autobuild/tmp/rpm-build/BUILD/lsb-test-qt3-azov-4.0.0/libqt-mt-t2c/Normal_Test-t2c/tests/Functions//QMakefile
QTDIR=/opt/lsb make -f QMakefile
make[3]: Entering directory `/nethome/autobuild/tmp/rpm-build/BUILD/lsb-test-qt3-azov-4.0.0/libqt-mt-t2c/Normal_Test-t2c/tests/Functions'
lsbc++ -c -pipe -Wall -W -O2  -DT2C_IGNORE_RCAT_ERRORS -DQT_SESSIONMANAGER -DQT_THREAD_SUPPORT -DQT_SHARED -DQT_NO_DEBUG -DQT_NO_DEBUG -I/opt/lsb/mkspecs/linux-lsb-qt3 -I. -I. -I/nethome/autobuild/tmp/rpm-build/BUILD/lsb-test-qt3-azov-4.0.0/libqt-mt-t2c/supp_headers -I/nethome/autobuild/tmp/rpm-build/BUILD/lsb-test-qt3-azov-4.0.0/t2c_framework/t2c/include -I/opt/lsb-tet3-lite/inc/tet3 -I/opt/lsb/include -o Functions.o Functions.cpp
Functions.cpp: In function 'void test_purpose_1()':
Functions.cpp:238: warning: label 'purpose_finally_section_' defined but not used
Functions.cpp: In function 'void test_purpose_2()':
Functions.cpp:280: warning: label 'purpose_finally_section_' defined but not used
Functions.cpp: At global scope:
Functions.cpp:134: warning: 'void user_startup()' declared 'static' but never defined
lsbc++ -Wl,-rpath,/opt/lsb-tet3-lite/lib/tet3 -Wl,-rpath,/nethome/autobuild/tmp/rpm-build/BUILD/lsb-test-qt3-azov-4.0.0/t2c_framework/t2c/lib -Wl,-rpath,/usr/X11R6/lib  -Wl,-rpath,/opt/lsb/lib -o Functions Functions.o    -L/opt/lsb-tet3-lite/lib/tet3 -L/nethome/autobuild/tmp/rpm-build/BUILD/lsb-test-qt3-azov-4.0.0/t2c_framework/t2c/lib -L/usr/X11R6/lib -L/opt/lsb/lib /opt/lsb-tet3-lite/lib/tet3/tcm.o /opt/lsb-tet3-lite/lib/tet3/libapi.a /nethome/autobuild/tmp/rpm-build/BUILD/lsb-test-qt3-azov-4.0.0/t2c_framework/t2c/lib/t2c_util.a /nethome/autobuild/tmp/rpm-build/BUILD/lsb-test-qt3-azov-4.0.0/t2c_framework/t2c/lib/t2c_tet_support.a -lX11 -lqt-mt
make[3]: Leaving directory `/nethome/autobuild/tmp/rpm-build/BUILD/lsb-test-qt3-azov-4.0.0/libqt-mt-t2c/Normal_Test-t2c/tests/Functions'
make[2]: Leaving directory `/nethome/autobuild/tmp/rpm-build/BUILD/lsb-test-qt3-azov-4.0.0/libqt-mt-t2c/Normal_Test-t2c/tests/Functions'
make -C QButtonGroup
make[2]: Entering directory `/nethome/autobuild/tmp/rpm-build/BUILD/lsb-test-qt3-azov-4.0.0/libqt-mt-t2c/Normal_Test-t2c/tests/QButtonGroup'
/opt/lsb/bin/qmake -project
sh /nethome/autobuild/tmp/rpm-build/BUILD/lsb-test-qt3-azov-4.0.0/libqt-mt-t2c/chgProj.sh /nethome/autobuild/tmp/rpm-build/BUILD/lsb-test-qt3-azov-4.0.0/libqt-mt-t2c/Normal_Test-t2c/tests/QButtonGroup//QButtonGroup'.pro' /nethome/autobuild/tmp/rpm-build/BUILD/lsb-test-qt3-azov-4.0.0/libqt-mt-t2c/Normal_Test-t2c/tests/QButtonGroup//QButtonGroup'.cpp'
/opt/lsb/bin/qmake -o QMakefile
sh /nethome/autobuild/tmp/rpm-build/BUILD/lsb-test-qt3-azov-4.0.0/libqt-mt-t2c/chgMake.sh /nethome/autobuild/tmp/rpm-build/BUILD/lsb-test-qt3-azov-4.0.0/libqt-mt-t2c/Normal_Test-t2c/tests/QButtonGroup//QMakefile
QTDIR=/opt/lsb make -f QMakefile
make[3]: Entering directory `/nethome/autobuild/tmp/rpm-build/BUILD/lsb-test-qt3-azov-4.0.0/libqt-mt-t2c/Normal_Test-t2c/tests/QButtonGroup'
lsbc++ -c -pipe -Wall -W -O2  -DT2C_IGNORE_RCAT_ERRORS -DQT_SESSIONMANAGER -DQT_THREAD_SUPPORT -DQT_SHARED -DQT_NO_DEBUG -DQT_NO_DEBUG -I/opt/lsb/mkspecs/linux-lsb-qt3 -I. -I. -I/nethome/autobuild/tmp/rpm-build/BUILD/lsb-test-qt3-azov-4.0.0/libqt-mt-t2c/supp_headers -I/nethome/autobuild/tmp/rpm-build/BUILD/lsb-test-qt3-azov-4.0.0/t2c_framework/t2c/include -I/opt/lsb-tet3-lite/inc/tet3 -I/opt/lsb/include -o QButtonGroup.o QButtonGroup.cpp
QButtonGroup.cpp: In function 'void test_purpose_1()':
QButtonGroup.cpp:281: warning: label 'purpose_finally_section_' defined but not used
QButtonGroup.cpp: In function 'void test_purpose_2()':
QButtonGroup.cpp:334: warning: label 'purpose_finally_section_' defined but not used
QButtonGroup.cpp: At global scope:
QButtonGroup.cpp:134: warning: 'void user_startup()' declared 'static' but never defined
lsbc++ -Wl,-rpath,/opt/lsb-tet3-lite/lib/tet3 -Wl,-rpath,/nethome/autobuild/tmp/rpm-build/BUILD/lsb-test-qt3-azov-4.0.0/t2c_framework/t2c/lib -Wl,-rpath,/usr/X11R6/lib  -Wl,-rpath,/opt/lsb/lib -o QButtonGroup QButtonGroup.o    -L/opt/lsb-tet3-lite/lib/tet3 -L/nethome/autobuild/tmp/rpm-build/BUILD/lsb-test-qt3-azov-4.0.0/t2c_framework/t2c/lib -L/usr/X11R6/lib -L/opt/lsb/lib /opt/lsb-tet3-lite/lib/tet3/tcm.o /opt/lsb-tet3-lite/lib/tet3/libapi.a /nethome/autobuild/tmp/rpm-build/BUILD/lsb-test-qt3-azov-4.0.0/t2c_framework/t2c/lib/t2c_util.a /nethome/autobuild/tmp/rpm-build/BUILD/lsb-test-qt3-azov-4.0.0/t2c_framework/t2c/lib/t2c_tet_support.a -lX11 -lqt-mt
make[3]: Leaving directory `/nethome/autobuild/tmp/rpm-build/BUILD/lsb-test-qt3-azov-4.0.0/libqt-mt-t2c/Normal_Test-t2c/tests/QButtonGroup'
make[2]: Leaving directory `/nethome/autobuild/tmp/rpm-build/BUILD/lsb-test-qt3-azov-4.0.0/libqt-mt-t2c/Normal_Test-t2c/tests/QButtonGroup'
make -C QGLContext
make[2]: Entering directory `/nethome/autobuild/tmp/rpm-build/BUILD/lsb-test-qt3-azov-4.0.0/libqt-mt-t2c/Normal_Test-t2c/tests/QGLContext'
/opt/lsb/bin/qmake -project
sh /nethome/autobuild/tmp/rpm-build/BUILD/lsb-test-qt3-azov-4.0.0/libqt-mt-t2c/chgProj.sh /nethome/autobuild/tmp/rpm-build/BUILD/lsb-test-qt3-azov-4.0.0/libqt-mt-t2c/Normal_Test-t2c/tests/QGLContext//QGLContext'.pro' /nethome/autobuild/tmp/rpm-build/BUILD/lsb-test-qt3-azov-4.0.0/libqt-mt-t2c/Normal_Test-t2c/tests/QGLContext//QGLContext'.cpp'
/opt/lsb/bin/qmake -o QMakefile
sh /nethome/autobuild/tmp/rpm-build/BUILD/lsb-test-qt3-azov-4.0.0/libqt-mt-t2c/chgMake.sh /nethome/autobuild/tmp/rpm-build/BUILD/lsb-test-qt3-azov-4.0.0/libqt-mt-t2c/Normal_Test-t2c/tests/QGLContext//QMakefile
QTDIR=/opt/lsb make -f QMakefile
make[3]: Entering directory `/nethome/autobuild/tmp/rpm-build/BUILD/lsb-test-qt3-azov-4.0.0/libqt-mt-t2c/Normal_Test-t2c/tests/QGLContext'
lsbc++ -c -pipe -Wall -W -O2  -DT2C_IGNORE_RCAT_ERRORS -DQT_SESSIONMANAGER -DQT_THREAD_SUPPORT -DQT_SHARED -DQT_NO_DEBUG -DQT_NO_DEBUG -I/opt/lsb/mkspecs/linux-lsb-qt3 -I. -I. -I/nethome/autobuild/tmp/rpm-build/BUILD/lsb-test-qt3-azov-4.0.0/libqt-mt-t2c/supp_headers -I/nethome/autobuild/tmp/rpm-build/BUILD/lsb-test-qt3-azov-4.0.0/t2c_framework/t2c/include -I/opt/lsb-tet3-lite/inc/tet3 -I/opt/lsb/include -o QGLContext.o QGLContext.cpp
QGLContext.cpp: In function 'void test_purpose_1()':
QGLContext.cpp:286: warning: label 'purpose_finally_section_' defined but not used
QGLContext.cpp: At global scope:
QGLContext.cpp:134: warning: 'void user_startup()' declared 'static' but never defined
lsbc++ -Wl,-rpath,/opt/lsb-tet3-lite/lib/tet3 -Wl,-rpath,/nethome/autobuild/tmp/rpm-build/BUILD/lsb-test-qt3-azov-4.0.0/t2c_framework/t2c/lib -Wl,-rpath,/usr/X11R6/lib  -Wl,-rpath,/opt/lsb/lib -o QGLContext QGLContext.o    -L/opt/lsb-tet3-lite/lib/tet3 -L/nethome/autobuild/tmp/rpm-build/BUILD/lsb-test-qt3-azov-4.0.0/t2c_framework/t2c/lib -L/usr/X11R6/lib -L/opt/lsb/lib /opt/lsb-tet3-lite/lib/tet3/tcm.o /opt/lsb-tet3-lite/lib/tet3/libapi.a /nethome/autobuild/tmp/rpm-build/BUILD/lsb-test-qt3-azov-4.0.0/t2c_framework/t2c/lib/t2c_util.a /nethome/autobuild/tmp/rpm-build/BUILD/lsb-test-qt3-azov-4.0.0/t2c_framework/t2c/lib/t2c_tet_support.a -lX11 -lqt-mt
make[3]: Leaving directory `/nethome/autobuild/tmp/rpm-build/BUILD/lsb-test-qt3-azov-4.0.0/libqt-mt-t2c/Normal_Test-t2c/tests/QGLContext'
make[2]: Leaving directory `/nethome/autobuild/tmp/rpm-build/BUILD/lsb-test-qt3-azov-4.0.0/libqt-mt-t2c/Normal_Test-t2c/tests/QGLContext'
make -C QGLWidget
make[2]: Entering directory `/nethome/autobuild/tmp/rpm-build/BUILD/lsb-test-qt3-azov-4.0.0/libqt-mt-t2c/Normal_Test-t2c/tests/QGLWidget'
/opt/lsb/bin/qmake -project
sh /nethome/autobuild/tmp/rpm-build/BUILD/lsb-test-qt3-azov-4.0.0/libqt-mt-t2c/chgProj.sh /nethome/autobuild/tmp/rpm-build/BUILD/lsb-test-qt3-azov-4.0.0/libqt-mt-t2c/Normal_Test-t2c/tests/QGLWidget//QGLWidget'.pro' /nethome/autobuild/tmp/rpm-build/BUILD/lsb-test-qt3-azov-4.0.0/libqt-mt-t2c/Normal_Test-t2c/tests/QGLWidget//QGLWidget'.cpp'
/opt/lsb/bin/qmake -o QMakefile
sh /nethome/autobuild/tmp/rpm-build/BUILD/lsb-test-qt3-azov-4.0.0/libqt-mt-t2c/chgMake.sh /nethome/autobuild/tmp/rpm-build/BUILD/lsb-test-qt3-azov-4.0.0/libqt-mt-t2c/Normal_Test-t2c/tests/QGLWidget//QMakefile
QTDIR=/opt/lsb make -f QMakefile
make[3]: Entering directory `/nethome/autobuild/tmp/rpm-build/BUILD/lsb-test-qt3-azov-4.0.0/libqt-mt-t2c/Normal_Test-t2c/tests/QGLWidget'
lsbc++ -c -pipe -Wall -W -O2  -DT2C_IGNORE_RCAT_ERRORS -DQT_SESSIONMANAGER -DQT_THREAD_SUPPORT -DQT_SHARED -DQT_NO_DEBUG -DQT_NO_DEBUG -I/opt/lsb/mkspecs/linux-lsb-qt3 -I. -I. -I/nethome/autobuild/tmp/rpm-build/BUILD/lsb-test-qt3-azov-4.0.0/libqt-mt-t2c/supp_headers -I/nethome/autobuild/tmp/rpm-build/BUILD/lsb-test-qt3-azov-4.0.0/t2c_framework/t2c/include -I/opt/lsb-tet3-lite/inc/tet3 -I/opt/lsb/include -o QGLWidget.o QGLWidget.cpp
QGLWidget.cpp: In function 'void test_purpose_1()':
QGLWidget.cpp:269: warning: unused variable 'app'
QGLWidget.cpp:280: warning: label 'purpose_finally_section_' defined but not used
QGLWidget.cpp: At global scope:
QGLWidget.cpp:134: warning: 'void user_startup()' declared 'static' but never defined
lsbc++ -Wl,-rpath,/opt/lsb-tet3-lite/lib/tet3 -Wl,-rpath,/nethome/autobuild/tmp/rpm-build/BUILD/lsb-test-qt3-azov-4.0.0/t2c_framework/t2c/lib -Wl,-rpath,/usr/X11R6/lib  -Wl,-rpath,/opt/lsb/lib -o QGLWidget QGLWidget.o    -L/opt/lsb-tet3-lite/lib/tet3 -L/nethome/autobuild/tmp/rpm-build/BUILD/lsb-test-qt3-azov-4.0.0/t2c_framework/t2c/lib -L/usr/X11R6/lib -L/opt/lsb/lib /opt/lsb-tet3-lite/lib/tet3/tcm.o /opt/lsb-tet3-lite/lib/tet3/libapi.a /nethome/autobuild/tmp/rpm-build/BUILD/lsb-test-qt3-azov-4.0.0/t2c_framework/t2c/lib/t2c_util.a /nethome/autobuild/tmp/rpm-build/BUILD/lsb-test-qt3-azov-4.0.0/t2c_framework/t2c/lib/t2c_tet_support.a -lX11 -lqt-mt
make[3]: Leaving directory `/nethome/autobuild/tmp/rpm-build/BUILD/lsb-test-qt3-azov-4.0.0/libqt-mt-t2c/Normal_Test-t2c/tests/QGLWidget'
make[2]: Leaving directory `/nethome/autobuild/tmp/rpm-build/BUILD/lsb-test-qt3-azov-4.0.0/libqt-mt-t2c/Normal_Test-t2c/tests/QGLWidget'
make -C QIconView
make[2]: Entering directory `/nethome/autobuild/tmp/rpm-build/BUILD/lsb-test-qt3-azov-4.0.0/libqt-mt-t2c/Normal_Test-t2c/tests/QIconView'
/opt/lsb/bin/qmake -project
sh /nethome/autobuild/tmp/rpm-build/BUILD/lsb-test-qt3-azov-4.0.0/libqt-mt-t2c/chgProj.sh /nethome/autobuild/tmp/rpm-build/BUILD/lsb-test-qt3-azov-4.0.0/libqt-mt-t2c/Normal_Test-t2c/tests/QIconView//QIconView'.pro' /nethome/autobuild/tmp/rpm-build/BUILD/lsb-test-qt3-azov-4.0.0/libqt-mt-t2c/Normal_Test-t2c/tests/QIconView//QIconView'.cpp'
/opt/lsb/bin/qmake -o QMakefile
sh /nethome/autobuild/tmp/rpm-build/BUILD/lsb-test-qt3-azov-4.0.0/libqt-mt-t2c/chgMake.sh /nethome/autobuild/tmp/rpm-build/BUILD/lsb-test-qt3-azov-4.0.0/libqt-mt-t2c/Normal_Test-t2c/tests/QIconView//QMakefile
QTDIR=/opt/lsb make -f QMakefile
make[3]: Entering directory `/nethome/autobuild/tmp/rpm-build/BUILD/lsb-test-qt3-azov-4.0.0/libqt-mt-t2c/Normal_Test-t2c/tests/QIconView'
lsbc++ -c -pipe -Wall -W -O2  -DT2C_IGNORE_RCAT_ERRORS -DQT_SESSIONMANAGER -DQT_THREAD_SUPPORT -DQT_SHARED -DQT_NO_DEBUG -DQT_NO_DEBUG -I/opt/lsb/mkspecs/linux-lsb-qt3 -I. -I. -I/nethome/autobuild/tmp/rpm-build/BUILD/lsb-test-qt3-azov-4.0.0/libqt-mt-t2c/supp_headers -I/nethome/autobuild/tmp/rpm-build/BUILD/lsb-test-qt3-azov-4.0.0/t2c_framework/t2c/include -I/opt/lsb-tet3-lite/inc/tet3 -I/opt/lsb/include -o QIconView.o QIconView.cpp
QIconView.cpp: In function 'void test_purpose_1()':
QIconView.cpp:292: warning: label 'purpose_finally_section_' defined but not used
QIconView.cpp: At global scope:
QIconView.cpp:134: warning: 'void user_startup()' declared 'static' but never defined
lsbc++ -Wl,-rpath,/opt/lsb-tet3-lite/lib/tet3 -Wl,-rpath,/nethome/autobuild/tmp/rpm-build/BUILD/lsb-test-qt3-azov-4.0.0/t2c_framework/t2c/lib -Wl,-rpath,/usr/X11R6/lib  -Wl,-rpath,/opt/lsb/lib -o QIconView QIconView.o    -L/opt/lsb-tet3-lite/lib/tet3 -L/nethome/autobuild/tmp/rpm-build/BUILD/lsb-test-qt3-azov-4.0.0/t2c_framework/t2c/lib -L/usr/X11R6/lib -L/opt/lsb/lib /opt/lsb-tet3-lite/lib/tet3/tcm.o /opt/lsb-tet3-lite/lib/tet3/libapi.a /nethome/autobuild/tmp/rpm-build/BUILD/lsb-test-qt3-azov-4.0.0/t2c_framework/t2c/lib/t2c_util.a /nethome/autobuild/tmp/rpm-build/BUILD/lsb-test-qt3-azov-4.0.0/t2c_framework/t2c/lib/t2c_tet_support.a -lX11 -lqt-mt
make[3]: Leaving directory `/nethome/autobuild/tmp/rpm-build/BUILD/lsb-test-qt3-azov-4.0.0/libqt-mt-t2c/Normal_Test-t2c/tests/QIconView'
make[2]: Leaving directory `/nethome/autobuild/tmp/rpm-build/BUILD/lsb-test-qt3-azov-4.0.0/libqt-mt-t2c/Normal_Test-t2c/tests/QIconView'
make -C QSessionManager
make[2]: Entering directory `/nethome/autobuild/tmp/rpm-build/BUILD/lsb-test-qt3-azov-4.0.0/libqt-mt-t2c/Normal_Test-t2c/tests/QSessionManager'
/opt/lsb/bin/qmake -project
sh /nethome/autobuild/tmp/rpm-build/BUILD/lsb-test-qt3-azov-4.0.0/libqt-mt-t2c/chgProj.sh /nethome/autobuild/tmp/rpm-build/BUILD/lsb-test-qt3-azov-4.0.0/libqt-mt-t2c/Normal_Test-t2c/tests/QSessionManager//QSessionManager'.pro' /nethome/autobuild/tmp/rpm-build/BUILD/lsb-test-qt3-azov-4.0.0/libqt-mt-t2c/Normal_Test-t2c/tests/QSessionManager//QSessionManager'.cpp'
/opt/lsb/bin/qmake -o QMakefile
sh /nethome/autobuild/tmp/rpm-build/BUILD/lsb-test-qt3-azov-4.0.0/libqt-mt-t2c/chgMake.sh /nethome/autobuild/tmp/rpm-build/BUILD/lsb-test-qt3-azov-4.0.0/libqt-mt-t2c/Normal_Test-t2c/tests/QSessionManager//QMakefile
QTDIR=/opt/lsb make -f QMakefile
make[3]: Entering directory `/nethome/autobuild/tmp/rpm-build/BUILD/lsb-test-qt3-azov-4.0.0/libqt-mt-t2c/Normal_Test-t2c/tests/QSessionManager'
lsbc++ -c -pipe -Wall -W -O2  -DT2C_IGNORE_RCAT_ERRORS -DQT_SESSIONMANAGER -DQT_THREAD_SUPPORT -DQT_SHARED -DQT_NO_DEBUG -DQT_NO_DEBUG -I/opt/lsb/mkspecs/linux-lsb-qt3 -I. -I. -I/nethome/autobuild/tmp/rpm-build/BUILD/lsb-test-qt3-azov-4.0.0/libqt-mt-t2c/supp_headers -I/nethome/autobuild/tmp/rpm-build/BUILD/lsb-test-qt3-azov-4.0.0/t2c_framework/t2c/include -I/opt/lsb-tet3-lite/inc/tet3 -I/usr/X11R6/include/X11 -I/opt/lsb/include -o QSessionManager.o QSessionManager.cpp
/opt/lsb/include/private/qucom_p.h:69: warning: 'struct QUBuffer' has virtual functions but non-virtual destructor
/opt/lsb/include/private/qucom_p.h:77: warning: 'struct QUType' has virtual functions but non-virtual destructor
/opt/lsb/include/private/qucom_p.h:104: warning: 'struct QUType_Null' has virtual functions but non-virtual destructor
/opt/lsb/include/private/qucom_p.h:287: warning: 'struct QUType_enum' has virtual functions but non-virtual destructor
/opt/lsb/include/private/qucom_p.h:307: warning: 'struct QUType_ptr' has virtual functions but non-virtual destructor
/opt/lsb/include/private/qucom_p.h:326: warning: 'struct QUType_iface' has virtual functions but non-virtual destructor
/opt/lsb/include/private/qucom_p.h:345: warning: 'struct QUType_idisp' has virtual functions but non-virtual destructor
/opt/lsb/include/private/qucom_p.h:364: warning: 'struct QUType_bool' has virtual functions but non-virtual destructor
/opt/lsb/include/private/qucom_p.h:383: warning: 'struct QUType_int' has virtual functions but non-virtual destructor
/opt/lsb/include/private/qucom_p.h:403: warning: 'struct QUType_double' has virtual functions but non-virtual destructor
/opt/lsb/include/private/qucom_p.h:423: warning: 'struct QUType_charstar' has virtual functions but non-virtual destructor
/opt/lsb/include/private/qucom_p.h:444: warning: 'struct QUType_QString' has virtual functions but non-virtual destructor
/opt/lsb/include/X11/VendorP.h:35: error: 'ShellPart' does not name a type
/opt/lsb/include/X11/VendorP.h:36: error: 'WMShellPart' does not name a type
/opt/lsb/include/X11/VendorP.h:45: error: 'ShellClassPart' does not name a type
/opt/lsb/include/X11/VendorP.h:46: error: 'WMShellClassPart' does not name a type
QSessionManager.cpp:313: warning: unused parameter 'hostname'
QSessionManager.cpp: In function 'char* unique_filename(char*, char*)':
QSessionManager.cpp:349: warning: 'tempnam' is deprecated (declared at /opt/lsb/include/stdio.h:173)
QSessionManager.cpp:349: warning: 'tempnam' is deprecated (declared at /opt/lsb/include/stdio.h:173)
QSessionManager.cpp: At global scope:
QSessionManager.cpp:839: warning: unused parameter 'sig'
QSessionManager.cpp: In function 'int auth_initialize(char*)':
QSessionManager.cpp:895: warning: array subscript has type 'char'
QSessionManager.cpp:896: warning: array subscript has type 'char'
QSessionManager.cpp:897: warning: array subscript has type 'char'
QSessionManager.cpp:898: warning: array subscript has type 'char'
QSessionManager.cpp:899: warning: array subscript has type 'char'
QSessionManager.cpp:900: warning: array subscript has type 'char'
QSessionManager.cpp:901: warning: array subscript has type 'char'
QSessionManager.cpp:902: warning: array subscript has type 'char'
QSessionManager.cpp:903: warning: array subscript has type 'char'
QSessionManager.cpp:904: warning: array subscript has type 'char'
QSessionManager.cpp:905: warning: array subscript has type 'char'
QSessionManager.cpp:905: warning: array subscript has type 'char'
QSessionManager.cpp:906: warning: array subscript has type 'char'
QSessionManager.cpp:906: warning: array subscript has type 'char'
QSessionManager.cpp:907: warning: array subscript has type 'char'
QSessionManager.cpp:907: warning: array subscript has type 'char'
QSessionManager.cpp:908: warning: array subscript has type 'char'
QSessionManager.cpp:908: warning: array subscript has type 'char'
QSessionManager.cpp:909: warning: array subscript has type 'char'
QSessionManager.cpp:909: warning: array subscript has type 'char'
QSessionManager.cpp:910: warning: array subscript has type 'char'
QSessionManager.cpp:910: warning: array subscript has type 'char'
QSessionManager.cpp: In function 'int SetAuthentication(int, _IceListenObj**, IceAuthDataEntry**)':
QSessionManager.cpp:1602: warning: unused variable 'command'
QSessionManager.cpp: At global scope:
QSessionManager.cpp:2061: warning: unused parameter 'smsConn'
QSessionManager.cpp:2061: warning: unused parameter 'managerData'
QSessionManager.cpp:2061: warning: unused parameter 'numProps'
QSessionManager.cpp:2061: warning: unused parameter 'props'
QSessionManager.cpp:2070: warning: unused parameter 'smsConn'
QSessionManager.cpp:2070: warning: unused parameter 'managerData'
QSessionManager.cpp:2070: warning: unused parameter 'numProps'
QSessionManager.cpp:2070: warning: unused parameter 'propNames'
QSessionManager.cpp:2079: warning: unused parameter 'smsConn'
QSessionManager.cpp:2079: warning: unused parameter 'managerData'
QSessionManager.cpp:2177: warning: unused parameter 'closure'
QSessionManager.cpp:2177: warning: unused parameter 'id'
QSessionManager.cpp:2219: warning: unused parameter 'sig'
QSessionManager.cpp:2225: warning: unused parameter 'closure'
QSessionManager.cpp:2225: warning: unused parameter 'id'
QSessionManager.cpp:2232: warning: unused parameter 'sig'
QSessionManager.cpp:2238: warning: unused parameter 'closure'
QSessionManager.cpp:2238: warning: unused parameter 'id'
QSessionManager.cpp:2366: warning: unused parameter 'source'
QSessionManager.cpp:2366: warning: unused parameter 'id'
QSessionManager.cpp:2584: warning: unused parameter 'smsConn'
QSessionManager.cpp:2607: warning: unused parameter 'smsConn'
QSessionManager.cpp:2607: warning: unused parameter 'managerData'
QSessionManager.cpp:2607: warning: unused parameter 'cancelShutdown'
QSessionManager.cpp:2616: warning: unused parameter 'smsConn'
QSessionManager.cpp:2616: warning: unused parameter 'managerData'
QSessionManager.cpp:2616: warning: unused parameter 'saveType'
QSessionManager.cpp:2616: warning: unused parameter 'shutdown'
QSessionManager.cpp:2616: warning: unused parameter 'interactStyle'
QSessionManager.cpp:2616: warning: unused parameter 'fast'
QSessionManager.cpp:2616: warning: unused parameter 'global'
QSessionManager.cpp:2624: warning: unused parameter 'smsConn'
QSessionManager.cpp:2624: warning: unused parameter 'managerData'
QSessionManager.cpp:2632: warning: unused parameter 'smsConn'
QSessionManager.cpp:2632: warning: unused parameter 'managerData'
QSessionManager.cpp:2632: warning: unused parameter 'success'
QSessionManager.cpp:2639: warning: unused parameter 'smsConn'
QSessionManager.cpp:2661: warning: unused parameter 'managerData'
QSessionManager.cpp:2753: warning: unused parameter 'source'
QSessionManager.cpp:2753: warning: unused parameter 'id'
QSessionManager.cpp: In member function 'virtual void QApplicationChild::saveState(QSessionManager&)':
QSessionManager.cpp:2865: warning: dereferencing type-punned pointer will break strict-aliasing rules
QSessionManager.cpp:2866: warning: unused variable 'Par_3_Tmp1'
QSessionManager.cpp: At global scope:
QSessionManager.cpp:2942: warning: unused parameter 'client_data'
QSessionManager.cpp:2942: warning: unused parameter 'id'
QSessionManager.cpp: In function 'void test_purpose_1()':
QSessionManager.cpp:3145: warning: label 'purpose_finally_section_' defined but not used
QSessionManager.cpp: In function 'void test_purpose_2()':
QSessionManager.cpp:3324: warning: label 'purpose_finally_section_' defined but not used
QSessionManager.cpp: In function 'void test_purpose_3()':
QSessionManager.cpp:3503: warning: label 'purpose_finally_section_' defined but not used
QSessionManager.cpp: In function 'void test_purpose_4()':
QSessionManager.cpp:3682: warning: label 'purpose_finally_section_' defined but not used
QSessionManager.cpp: In function 'void test_purpose_5()':
QSessionManager.cpp:3861: warning: label 'purpose_finally_section_' defined but not used
QSessionManager.cpp: In function 'void test_purpose_6()':
QSessionManager.cpp:4040: warning: label 'purpose_finally_section_' defined but not used
QSessionManager.cpp: In function 'void test_purpose_7()':
QSessionManager.cpp:4219: warning: label 'purpose_finally_section_' defined but not used
QSessionManager.cpp: In function 'void test_purpose_8()':
QSessionManager.cpp:4398: warning: label 'purpose_finally_section_' defined but not used
QSessionManager.cpp: In function 'void test_purpose_9()':
QSessionManager.cpp:4577: warning: label 'purpose_finally_section_' defined but not used
QSessionManager.cpp: In function 'void test_purpose_10()':
QSessionManager.cpp:4756: warning: label 'purpose_finally_section_' defined but not used
QSessionManager.cpp: In function 'void test_purpose_11()':
QSessionManager.cpp:4935: warning: label 'purpose_finally_section_' defined but not used
QSessionManager.cpp: In function 'void test_purpose_12()':
QSessionManager.cpp:5114: warning: label 'purpose_finally_section_' defined but not used
QSessionManager.cpp: In function 'void test_purpose_13()':
QSessionManager.cpp:5293: warning: label 'purpose_finally_section_' defined but not used
QSessionManager.cpp: In function 'void test_purpose_14()':
QSessionManager.cpp:5472: warning: label 'purpose_finally_section_' defined but not used
QSessionManager.cpp: In function 'void test_purpose_15()':
QSessionManager.cpp:5651: warning: label 'purpose_finally_section_' defined but not used
QSessionManager.cpp: In function 'void test_purpose_16()':
QSessionManager.cpp:5830: warning: label 'purpose_finally_section_' defined but not used
QSessionManager.cpp: In function 'void test_purpose_17()':
QSessionManager.cpp:6009: warning: label 'purpose_finally_section_' defined but not used
QSessionManager.cpp: In function 'void test_purpose_18()':
QSessionManager.cpp:6188: warning: label 'purpose_finally_section_' defined but not used
QSessionManager.cpp: In function 'void test_purpose_19()':
QSessionManager.cpp:6367: warning: label 'purpose_finally_section_' defined but not used
QSessionManager.cpp: In function 'void test_purpose_20()':
QSessionManager.cpp:6546: warning: label 'purpose_finally_section_' defined but not used
QSessionManager.cpp: In function 'void test_purpose_21()':
QSessionManager.cpp:6725: warning: label 'purpose_finally_section_' defined but not used
QSessionManager.cpp: In function 'void test_purpose_22()':
QSessionManager.cpp:6904: warning: label 'purpose_finally_section_' defined but not used
QSessionManager.cpp: At global scope:
QSessionManager.cpp:134: warning: 'void user_startup()' declared 'static' but never defined
make[3]: *** [QSessionManager.o] Error 1
make[3]: Leaving directory `/nethome/autobuild/tmp/rpm-build/BUILD/lsb-test-qt3-azov-4.0.0/libqt-mt-t2c/Normal_Test-t2c/tests/QSessionManager'
make[2]: *** [all] Error 2
make[2]: Leaving directory `/nethome/autobuild/tmp/rpm-build/BUILD/lsb-test-qt3-azov-4.0.0/libqt-mt-t2c/Normal_Test-t2c/tests/QSessionManager'
make[1]: *** [QSessionManager] Error 2
make[1]: Leaving directory `/nethome/autobuild/tmp/rpm-build/BUILD/lsb-test-qt3-azov-4.0.0/libqt-mt-t2c/Normal_Test-t2c/tests'
Failed to build tests for Normal_Test-t2c, aborting...
error: Bad exit status from /var/tmp/rpm-tmp.35761 (%build)


RPM build errors:
    Bad exit status from /var/tmp/rpm-tmp.35761 (%build)
expect: spawn id exp3 not open
    while executing
"expect "exit 0""
send: spawn id exp3 not open
    while executing
"send "\n""
mv: cannot stat `/nethome/autobuild/tmp/rpm-build/SRPMS/lsb-test-qt3-azov-4.0.0-4.src.rpm': No such file or directory
make: *** [lsb-test-qt3-azov-4.0.0-4.ia64.rpm] Error 1


More information about the lsb-messages mailing list