[Lsb-messages] Build failure for azov-qt4-tests on ia64

lsb-autobuild at freestandards.org lsb-autobuild at freestandards.org
Mon Apr 27 03:14:58 PDT 2009


This is an automated message generated when a build failure occurs

Linux fsgdev-ia64 2.6.18-6-mckinley #1 SMP Mon Feb 11 11:47:35 UTC 2008 ia64 ia64 ia64 GNU/Linux
Failed to make packages for azov-qt4-tests
bzr export --revision=-1 t2c_tmp_dir /nethome/autobuild/tmp/LSBauto/t2c-harness
bzr export --revision=-1 lsb-test-qt4-azov-4.0.0_tmp /nethome/autobuild/tmp/LSBauto/azov-qt4-tests
spawn rpmbuild --sign --rcfile /usr/lib/rpm/rpmrc:./rpmrc --define=_sourcedir /nethome/autobuild/tmp/LSBauto/azov-qt4-tests/LSB_Toolkit_Qt-t2c/package --define=_topdir /nethome/autobuild/tmp/rpm-build --define=_target_cpu ia64 -ba lsb-test-qt4-azov.spec
Enter pass phrase: 
Pass phrase is good.
Executing(%prep): /bin/sh -e /var/tmp/rpm-tmp.69005
+ umask 022
+ cd /nethome/autobuild/tmp/rpm-build/BUILD
+ '[' '!' -x /opt/lsb/bin/lsbc++ ']'
+ cd /nethome/autobuild/tmp/rpm-build/BUILD
+ rm -rf lsb-test-qt4-azov-4.0.0
+ /usr/bin/gzip -dc /nethome/autobuild/tmp/LSBauto/azov-qt4-tests/LSB_Toolkit_Qt-t2c/package/lsb-test-qt4-azov-4.0.0.src.tgz
+ tar -xf -
+ STATUS=0
+ '[' 0 -ne 0 ']'
+ cd lsb-test-qt4-azov-4.0.0
+ exit 0
Executing(%build): /bin/sh -e /var/tmp/rpm-tmp.69005
+ umask 022
+ cd /nethome/autobuild/tmp/rpm-build/BUILD
+ cd lsb-test-qt4-azov-4.0.0
+ chmod -R +rx .
++ pwd
+ CUR_DIR=/nethome/autobuild/tmp/rpm-build/BUILD/lsb-test-qt4-azov-4.0.0
+ export T2C_ROOT=/nethome/autobuild/tmp/rpm-build/BUILD/lsb-test-qt4-azov-4.0.0/t2c_framework
+ T2C_ROOT=/nethome/autobuild/tmp/rpm-build/BUILD/lsb-test-qt4-azov-4.0.0/t2c_framework
+ t2c_framework/t2c/build.sh
+ cd LSB_Toolkit_Qt-t2c
+ ./build_all.sh
LSB_ROOT is /opt/lsb, LSB_LIB_DIR is /opt/lsb/lib
TET_ROOT is /opt/lsb-tet3-lite
----------------------
Building Normal_Test-t2c
Language is CPP.
Makefile template for this test suite: $T2C_SUITE_ROOT/Normal_Test-t2c/Makefile.tmk.
Parsing file /nethome/autobuild/tmp/rpm-build/BUILD/lsb-test-qt4-azov-4.0.0/LSB_Toolkit_Qt-t2c/Normal_Test-t2c/src/QSessionManager/QSessionManager.t2c
Parsing file /nethome/autobuild/tmp/rpm-build/BUILD/lsb-test-qt4-azov-4.0.0/LSB_Toolkit_Qt-t2c/Normal_Test-t2c/src/Qt4_Core_Functions/Functions.t2c
Parsing file /nethome/autobuild/tmp/rpm-build/BUILD/lsb-test-qt4-azov-4.0.0/LSB_Toolkit_Qt-t2c/Normal_Test-t2c/src/QFileDialog/QFileDialog.t2c
make[1]: Entering directory `/nethome/autobuild/tmp/rpm-build/BUILD/lsb-test-qt4-azov-4.0.0/LSB_Toolkit_Qt-t2c/Normal_Test-t2c/tests'
make -C Functions
make[2]: Entering directory `/nethome/autobuild/tmp/rpm-build/BUILD/lsb-test-qt4-azov-4.0.0/LSB_Toolkit_Qt-t2c/Normal_Test-t2c/tests/Functions'
/opt/lsb/bin/qmake -project
sh /nethome/autobuild/tmp/rpm-build/BUILD/lsb-test-qt4-azov-4.0.0/LSB_Toolkit_Qt-t2c/chgProj.sh /nethome/autobuild/tmp/rpm-build/BUILD/lsb-test-qt4-azov-4.0.0/LSB_Toolkit_Qt-t2c/Normal_Test-t2c/tests/Functions//Functions'.pro' /nethome/autobuild/tmp/rpm-build/BUILD/lsb-test-qt4-azov-4.0.0/LSB_Toolkit_Qt-t2c/Normal_Test-t2c/tests/Functions//Functions'.cpp'
/opt/lsb/bin/qmake -o QMakefile
sh /nethome/autobuild/tmp/rpm-build/BUILD/lsb-test-qt4-azov-4.0.0/LSB_Toolkit_Qt-t2c/chgMake.sh /nethome/autobuild/tmp/rpm-build/BUILD/lsb-test-qt4-azov-4.0.0/LSB_Toolkit_Qt-t2c/Normal_Test-t2c/tests/Functions//QMakefile
QTDIR=/opt/lsb make -f QMakefile
make[3]: Entering directory `/nethome/autobuild/tmp/rpm-build/BUILD/lsb-test-qt4-azov-4.0.0/LSB_Toolkit_Qt-t2c/Normal_Test-t2c/tests/Functions'
lsbc++ -c -pipe -O2 -Wall -W -D_REENTRANT  -DT2C_IGNORE_RCAT_ERRORS -DQT_SESSIONMANAGER -DQT_THREAD_SUPPORT -DQT_SHARED -DQT_NO_DEBUG -DQT3_SUPPORT -DQT_NO_DEBUG -DQT_SVG_LIB -DQT_SQL_LIB -DQT_XML_LIB -DQT_OPENGL_LIB -DQT_GUI_LIB -DQT_NETWORK_LIB -DQT_CORE_LIB -I/opt/lsb/mkspecs/linux-lsb -I. -I/opt/lsb/include/QtCore -I/opt/lsb/include/QtCore -I/opt/lsb/include/QtNetwork -I/opt/lsb/include/QtNetwork -I/opt/lsb/include/QtGui -I/opt/lsb/include/QtGui -I/opt/lsb/include/QtOpenGL -I/opt/lsb/include/QtOpenGL -I/opt/lsb/include/QtXml -I/opt/lsb/include/QtXml -I/opt/lsb/include/QtSql -I/opt/lsb/include/QtSql -I/opt/lsb/include/QtSvg -I/opt/lsb/include/QtSvg -I/opt/lsb/include -I. -I/nethome/autobuild/tmp/rpm-build/BUILD/lsb-test-qt4-azov-4.0.0/LSB_Toolkit_Qt-t2c/supp_headers -I/nethome/autobuild/tmp/rpm-build/BUILD/lsb-test-qt4-azov-4.0.0/t2c_framework/t2c/include -I/opt/lsb-tet3-lite/inc/tet3 -I/usr/X11R6/include -I. -I. -o Functions.o Functions.cpp
Functions.cpp: In function 'void test_purpose_1()':
Functions.cpp:239: warning: label 'purpose_finally_section_' defined but not used
Functions.cpp: In function 'void test_purpose_2()':
Functions.cpp:281: warning: label 'purpose_finally_section_' defined but not used
Functions.cpp: In function 'void test_purpose_3()':
Functions.cpp:323: warning: label 'purpose_finally_section_' defined but not used
Functions.cpp: At global scope:
Functions.cpp:134: warning: 'void user_startup()' declared 'static' but never defined
lsbc++ -Wl,-rpath,/opt/lsb/lib -o Functions Functions.o    -L/opt/lsb-tet3-lite/lib/tet3 -L/nethome/autobuild/tmp/rpm-build/BUILD/lsb-test-qt4-azov-4.0.0/t2c_framework/t2c/lib -L/opt/lsb/lib -L/usr/X11R6/lib /opt/lsb-tet3-lite/lib/tet3/tcm.o /opt/lsb-tet3-lite/lib/tet3/libapi.a /nethome/autobuild/tmp/rpm-build/BUILD/lsb-test-qt4-azov-4.0.0/t2c_framework/t2c/lib/t2c_util.a /nethome/autobuild/tmp/rpm-build/BUILD/lsb-test-qt4-azov-4.0.0/t2c_framework/t2c/lib/t2c_tet_support.a -lX11 -lQtSvg -lQtSql -lQtXml -lQtOpenGL -lQtGui -lQtNetwork -lQtCore -lGLU -lGL -lpthread
make[3]: Leaving directory `/nethome/autobuild/tmp/rpm-build/BUILD/lsb-test-qt4-azov-4.0.0/LSB_Toolkit_Qt-t2c/Normal_Test-t2c/tests/Functions'
make[2]: Leaving directory `/nethome/autobuild/tmp/rpm-build/BUILD/lsb-test-qt4-azov-4.0.0/LSB_Toolkit_Qt-t2c/Normal_Test-t2c/tests/Functions'
make -C QFileDialog
make[2]: Entering directory `/nethome/autobuild/tmp/rpm-build/BUILD/lsb-test-qt4-azov-4.0.0/LSB_Toolkit_Qt-t2c/Normal_Test-t2c/tests/QFileDialog'
/opt/lsb/bin/qmake -project
sh /nethome/autobuild/tmp/rpm-build/BUILD/lsb-test-qt4-azov-4.0.0/LSB_Toolkit_Qt-t2c/chgProj.sh /nethome/autobuild/tmp/rpm-build/BUILD/lsb-test-qt4-azov-4.0.0/LSB_Toolkit_Qt-t2c/Normal_Test-t2c/tests/QFileDialog//QFileDialog'.pro' /nethome/autobuild/tmp/rpm-build/BUILD/lsb-test-qt4-azov-4.0.0/LSB_Toolkit_Qt-t2c/Normal_Test-t2c/tests/QFileDialog//QFileDialog'.cpp'
/opt/lsb/bin/qmake -o QMakefile
sh /nethome/autobuild/tmp/rpm-build/BUILD/lsb-test-qt4-azov-4.0.0/LSB_Toolkit_Qt-t2c/chgMake.sh /nethome/autobuild/tmp/rpm-build/BUILD/lsb-test-qt4-azov-4.0.0/LSB_Toolkit_Qt-t2c/Normal_Test-t2c/tests/QFileDialog//QMakefile
QTDIR=/opt/lsb make -f QMakefile
make[3]: Entering directory `/nethome/autobuild/tmp/rpm-build/BUILD/lsb-test-qt4-azov-4.0.0/LSB_Toolkit_Qt-t2c/Normal_Test-t2c/tests/QFileDialog'
lsbc++ -c -pipe -O2 -Wall -W -D_REENTRANT  -DT2C_IGNORE_RCAT_ERRORS -DQT_SESSIONMANAGER -DQT_THREAD_SUPPORT -DQT_SHARED -DQT_NO_DEBUG -DQT3_SUPPORT -DQT_NO_DEBUG -DQT_SVG_LIB -DQT_SQL_LIB -DQT_XML_LIB -DQT_OPENGL_LIB -DQT_GUI_LIB -DQT_NETWORK_LIB -DQT_CORE_LIB -I/opt/lsb/mkspecs/linux-lsb -I. -I/opt/lsb/include/QtCore -I/opt/lsb/include/QtCore -I/opt/lsb/include/QtNetwork -I/opt/lsb/include/QtNetwork -I/opt/lsb/include/QtGui -I/opt/lsb/include/QtGui -I/opt/lsb/include/QtOpenGL -I/opt/lsb/include/QtOpenGL -I/opt/lsb/include/QtXml -I/opt/lsb/include/QtXml -I/opt/lsb/include/QtSql -I/opt/lsb/include/QtSql -I/opt/lsb/include/QtSvg -I/opt/lsb/include/QtSvg -I/opt/lsb/include -I. -I/nethome/autobuild/tmp/rpm-build/BUILD/lsb-test-qt4-azov-4.0.0/LSB_Toolkit_Qt-t2c/supp_headers -I/nethome/autobuild/tmp/rpm-build/BUILD/lsb-test-qt4-azov-4.0.0/t2c_framework/t2c/include -I/opt/lsb-tet3-lite/inc/tet3 -I/usr/X11R6/include -I. -I. -o QFileDialog.o QFileDialog.cpp
QFileDialog.cpp: In function 'void test_purpose_1()':
QFileDialog.cpp:399: warning: label 'purpose_finally_section_' defined but not used
QFileDialog.cpp: At global scope:
QFileDialog.cpp:134: warning: 'void user_startup()' declared 'static' but never defined
lsbc++ -Wl,-rpath,/opt/lsb/lib -o QFileDialog QFileDialog.o    -L/opt/lsb-tet3-lite/lib/tet3 -L/nethome/autobuild/tmp/rpm-build/BUILD/lsb-test-qt4-azov-4.0.0/t2c_framework/t2c/lib -L/opt/lsb/lib -L/usr/X11R6/lib /opt/lsb-tet3-lite/lib/tet3/tcm.o /opt/lsb-tet3-lite/lib/tet3/libapi.a /nethome/autobuild/tmp/rpm-build/BUILD/lsb-test-qt4-azov-4.0.0/t2c_framework/t2c/lib/t2c_util.a /nethome/autobuild/tmp/rpm-build/BUILD/lsb-test-qt4-azov-4.0.0/t2c_framework/t2c/lib/t2c_tet_support.a -lX11 -lQtSvg -lQtSql -lQtXml -lQtOpenGL -lQtGui -lQtNetwork -lQtCore -lGLU -lGL -lpthread
make[3]: Leaving directory `/nethome/autobuild/tmp/rpm-build/BUILD/lsb-test-qt4-azov-4.0.0/LSB_Toolkit_Qt-t2c/Normal_Test-t2c/tests/QFileDialog'
make[2]: Leaving directory `/nethome/autobuild/tmp/rpm-build/BUILD/lsb-test-qt4-azov-4.0.0/LSB_Toolkit_Qt-t2c/Normal_Test-t2c/tests/QFileDialog'
make -C QSessionManager
make[2]: Entering directory `/nethome/autobuild/tmp/rpm-build/BUILD/lsb-test-qt4-azov-4.0.0/LSB_Toolkit_Qt-t2c/Normal_Test-t2c/tests/QSessionManager'
/opt/lsb/bin/qmake -project
sh /nethome/autobuild/tmp/rpm-build/BUILD/lsb-test-qt4-azov-4.0.0/LSB_Toolkit_Qt-t2c/chgProj.sh /nethome/autobuild/tmp/rpm-build/BUILD/lsb-test-qt4-azov-4.0.0/LSB_Toolkit_Qt-t2c/Normal_Test-t2c/tests/QSessionManager//QSessionManager'.pro' /nethome/autobuild/tmp/rpm-build/BUILD/lsb-test-qt4-azov-4.0.0/LSB_Toolkit_Qt-t2c/Normal_Test-t2c/tests/QSessionManager//QSessionManager'.cpp'
/opt/lsb/bin/qmake -o QMakefile
sh /nethome/autobuild/tmp/rpm-build/BUILD/lsb-test-qt4-azov-4.0.0/LSB_Toolkit_Qt-t2c/chgMake.sh /nethome/autobuild/tmp/rpm-build/BUILD/lsb-test-qt4-azov-4.0.0/LSB_Toolkit_Qt-t2c/Normal_Test-t2c/tests/QSessionManager//QMakefile
QTDIR=/opt/lsb make -f QMakefile
make[3]: Entering directory `/nethome/autobuild/tmp/rpm-build/BUILD/lsb-test-qt4-azov-4.0.0/LSB_Toolkit_Qt-t2c/Normal_Test-t2c/tests/QSessionManager'
lsbc++ -c -pipe -O2 -Wall -W -D_REENTRANT  -DT2C_IGNORE_RCAT_ERRORS -DQT_SESSIONMANAGER -DQT_THREAD_SUPPORT -DQT_SHARED -DQT_NO_DEBUG -DQT3_SUPPORT -DQT_NO_DEBUG -DQT_SVG_LIB -DQT_SQL_LIB -DQT_XML_LIB -DQT_OPENGL_LIB -DQT_GUI_LIB -DQT_NETWORK_LIB -DQT_CORE_LIB -I/opt/lsb/mkspecs/linux-lsb -I. -I/opt/lsb/include/QtCore -I/opt/lsb/include/QtCore -I/opt/lsb/include/QtNetwork -I/opt/lsb/include/QtNetwork -I/opt/lsb/include/QtGui -I/opt/lsb/include/QtGui -I/opt/lsb/include/QtOpenGL -I/opt/lsb/include/QtOpenGL -I/opt/lsb/include/QtXml -I/opt/lsb/include/QtXml -I/opt/lsb/include/QtSql -I/opt/lsb/include/QtSql -I/opt/lsb/include/QtSvg -I/opt/lsb/include/QtSvg -I/opt/lsb/include -I. -I/nethome/autobuild/tmp/rpm-build/BUILD/lsb-test-qt4-azov-4.0.0/LSB_Toolkit_Qt-t2c/supp_headers -I/nethome/autobuild/tmp/rpm-build/BUILD/lsb-test-qt4-azov-4.0.0/t2c_framework/t2c/include -I/opt/lsb-tet3-lite/inc/tet3 -I/usr/X11R6/include/X11 -I/usr/X11R6/include -I. -I. -o QSessionManager.o QSessionManager.cpp
/opt/lsb/include/X11/VendorP.h:35: error: 'ShellPart' does not name a type
/opt/lsb/include/X11/VendorP.h:36: error: 'WMShellPart' does not name a type
/opt/lsb/include/X11/VendorP.h:45: error: 'ShellClassPart' does not name a type
/opt/lsb/include/X11/VendorP.h:46: error: 'WMShellClassPart' does not name a type
QSessionManager.cpp:309: warning: unused parameter 'hostname'
QSessionManager.cpp: In function 'char* unique_filename(char*, char*)':
QSessionManager.cpp:345: warning: 'tempnam' is deprecated (declared at /opt/lsb/include/stdio.h:173)
QSessionManager.cpp:345: warning: 'tempnam' is deprecated (declared at /opt/lsb/include/stdio.h:173)
QSessionManager.cpp: At global scope:
QSessionManager.cpp:835: warning: unused parameter 'sig'
QSessionManager.cpp: In function 'int auth_initialize(char*)':
QSessionManager.cpp:891: warning: array subscript has type 'char'
QSessionManager.cpp:892: warning: array subscript has type 'char'
QSessionManager.cpp:893: warning: array subscript has type 'char'
QSessionManager.cpp:894: warning: array subscript has type 'char'
QSessionManager.cpp:895: warning: array subscript has type 'char'
QSessionManager.cpp:896: warning: array subscript has type 'char'
QSessionManager.cpp:897: warning: array subscript has type 'char'
QSessionManager.cpp:898: warning: array subscript has type 'char'
QSessionManager.cpp:899: warning: array subscript has type 'char'
QSessionManager.cpp:900: warning: array subscript has type 'char'
QSessionManager.cpp:901: warning: array subscript has type 'char'
QSessionManager.cpp:901: warning: array subscript has type 'char'
QSessionManager.cpp:902: warning: array subscript has type 'char'
QSessionManager.cpp:902: warning: array subscript has type 'char'
QSessionManager.cpp:903: warning: array subscript has type 'char'
QSessionManager.cpp:903: warning: array subscript has type 'char'
QSessionManager.cpp:904: warning: array subscript has type 'char'
QSessionManager.cpp:904: warning: array subscript has type 'char'
QSessionManager.cpp:905: warning: array subscript has type 'char'
QSessionManager.cpp:905: warning: array subscript has type 'char'
QSessionManager.cpp:906: warning: array subscript has type 'char'
QSessionManager.cpp:906: warning: array subscript has type 'char'
QSessionManager.cpp: In function 'int SetAuthentication(int, _IceListenObj**, IceAuthDataEntry**)':
QSessionManager.cpp:1598: warning: unused variable 'command'
QSessionManager.cpp: At global scope:
QSessionManager.cpp:2057: warning: unused parameter 'smsConn'
QSessionManager.cpp:2057: warning: unused parameter 'managerData'
QSessionManager.cpp:2057: warning: unused parameter 'numProps'
QSessionManager.cpp:2057: warning: unused parameter 'props'
QSessionManager.cpp:2066: warning: unused parameter 'smsConn'
QSessionManager.cpp:2066: warning: unused parameter 'managerData'
QSessionManager.cpp:2066: warning: unused parameter 'numProps'
QSessionManager.cpp:2066: warning: unused parameter 'propNames'
QSessionManager.cpp:2075: warning: unused parameter 'smsConn'
QSessionManager.cpp:2075: warning: unused parameter 'managerData'
QSessionManager.cpp:2173: warning: unused parameter 'closure'
QSessionManager.cpp:2173: warning: unused parameter 'id'
QSessionManager.cpp:2215: warning: unused parameter 'sig'
QSessionManager.cpp:2221: warning: unused parameter 'closure'
QSessionManager.cpp:2221: warning: unused parameter 'id'
QSessionManager.cpp:2228: warning: unused parameter 'sig'
QSessionManager.cpp:2234: warning: unused parameter 'closure'
QSessionManager.cpp:2234: warning: unused parameter 'id'
QSessionManager.cpp:2362: warning: unused parameter 'source'
QSessionManager.cpp:2362: warning: unused parameter 'id'
QSessionManager.cpp:2580: warning: unused parameter 'smsConn'
QSessionManager.cpp:2603: warning: unused parameter 'smsConn'
QSessionManager.cpp:2603: warning: unused parameter 'managerData'
QSessionManager.cpp:2603: warning: unused parameter 'cancelShutdown'
QSessionManager.cpp:2612: warning: unused parameter 'smsConn'
QSessionManager.cpp:2612: warning: unused parameter 'managerData'
QSessionManager.cpp:2612: warning: unused parameter 'saveType'
QSessionManager.cpp:2612: warning: unused parameter 'shutdown'
QSessionManager.cpp:2612: warning: unused parameter 'interactStyle'
QSessionManager.cpp:2612: warning: unused parameter 'fast'
QSessionManager.cpp:2612: warning: unused parameter 'global'
QSessionManager.cpp:2620: warning: unused parameter 'smsConn'
QSessionManager.cpp:2620: warning: unused parameter 'managerData'
QSessionManager.cpp:2628: warning: unused parameter 'smsConn'
QSessionManager.cpp:2628: warning: unused parameter 'managerData'
QSessionManager.cpp:2628: warning: unused parameter 'success'
QSessionManager.cpp:2635: warning: unused parameter 'smsConn'
QSessionManager.cpp:2657: warning: unused parameter 'managerData'
QSessionManager.cpp:2749: warning: unused parameter 'source'
QSessionManager.cpp:2749: warning: unused parameter 'id'
QSessionManager.cpp: In member function 'virtual void QApplicationChild::saveState(QSessionManager&)':
QSessionManager.cpp:2861: warning: dereferencing type-punned pointer will break strict-aliasing rules
QSessionManager.cpp: At global scope:
QSessionManager.cpp:2932: warning: unused parameter 'client_data'
QSessionManager.cpp:2932: warning: unused parameter 'id'
QSessionManager.cpp: In function 'void test_purpose_1()':
QSessionManager.cpp:3135: warning: label 'purpose_finally_section_' defined but not used
QSessionManager.cpp: In function 'void test_purpose_2()':
QSessionManager.cpp:3314: warning: label 'purpose_finally_section_' defined but not used
QSessionManager.cpp: In function 'void test_purpose_3()':
QSessionManager.cpp:3493: warning: label 'purpose_finally_section_' defined but not used
QSessionManager.cpp: In function 'void test_purpose_4()':
QSessionManager.cpp:3672: warning: label 'purpose_finally_section_' defined but not used
QSessionManager.cpp: In function 'void test_purpose_5()':
QSessionManager.cpp:3851: warning: label 'purpose_finally_section_' defined but not used
QSessionManager.cpp: In function 'void test_purpose_6()':
QSessionManager.cpp:4030: warning: label 'purpose_finally_section_' defined but not used
QSessionManager.cpp: In function 'void test_purpose_7()':
QSessionManager.cpp:4209: warning: label 'purpose_finally_section_' defined but not used
QSessionManager.cpp: In function 'void test_purpose_8()':
QSessionManager.cpp:4388: warning: label 'purpose_finally_section_' defined but not used
QSessionManager.cpp: In function 'void test_purpose_9()':
QSessionManager.cpp:4567: warning: label 'purpose_finally_section_' defined but not used
QSessionManager.cpp: In function 'void test_purpose_10()':
QSessionManager.cpp:4746: warning: label 'purpose_finally_section_' defined but not used
QSessionManager.cpp: In function 'void test_purpose_11()':
QSessionManager.cpp:4925: warning: label 'purpose_finally_section_' defined but not used
QSessionManager.cpp: In function 'void test_purpose_12()':
QSessionManager.cpp:5104: warning: label 'purpose_finally_section_' defined but not used
QSessionManager.cpp: In function 'void test_purpose_13()':
QSessionManager.cpp:5283: warning: label 'purpose_finally_section_' defined but not used
QSessionManager.cpp: In function 'void test_purpose_14()':
QSessionManager.cpp:5462: warning: label 'purpose_finally_section_' defined but not used
QSessionManager.cpp: In function 'void test_purpose_15()':
QSessionManager.cpp:5641: warning: label 'purpose_finally_section_' defined but not used
QSessionManager.cpp: In function 'void test_purpose_16()':
QSessionManager.cpp:5820: warning: label 'purpose_finally_section_' defined but not used
QSessionManager.cpp: In function 'void test_purpose_17()':
QSessionManager.cpp:5999: warning: label 'purpose_finally_section_' defined but not used
QSessionManager.cpp: In function 'void test_purpose_18()':
QSessionManager.cpp:6178: warning: label 'purpose_finally_section_' defined but not used
QSessionManager.cpp: In function 'void test_purpose_19()':
QSessionManager.cpp:6357: warning: label 'purpose_finally_section_' defined but not used
QSessionManager.cpp: In function 'void test_purpose_20()':
QSessionManager.cpp:6536: warning: label 'purpose_finally_section_' defined but not used
QSessionManager.cpp: At global scope:
QSessionManager.cpp:134: warning: 'void user_startup()' declared 'static' but never defined
make[3]: *** [QSessionManager.o] Error 1
make[3]: Leaving directory `/nethome/autobuild/tmp/rpm-build/BUILD/lsb-test-qt4-azov-4.0.0/LSB_Toolkit_Qt-t2c/Normal_Test-t2c/tests/QSessionManager'
make[2]: *** [all] Error 2
make[2]: Leaving directory `/nethome/autobuild/tmp/rpm-build/BUILD/lsb-test-qt4-azov-4.0.0/LSB_Toolkit_Qt-t2c/Normal_Test-t2c/tests/QSessionManager'
make[1]: *** [QSessionManager] Error 2
make[1]: Leaving directory `/nethome/autobuild/tmp/rpm-build/BUILD/lsb-test-qt4-azov-4.0.0/LSB_Toolkit_Qt-t2c/Normal_Test-t2c/tests'
Failed to build tests for Normal_Test-t2c, aborting...
error: Bad exit status from /var/tmp/rpm-tmp.69005 (%build)


RPM build errors:
    Bad exit status from /var/tmp/rpm-tmp.69005 (%build)
expect: spawn id exp3 not open
    while executing
"expect "exit 0""
send: spawn id exp3 not open
    while executing
"send "\n""
mv: cannot stat `/nethome/autobuild/tmp/rpm-build/SRPMS/lsb-test-qt4-azov-4.0.0-4.src.rpm': No such file or directory
make: *** [lsb-test-qt4-azov-4.0.0-4.ia64.rpm] Error 1


More information about the lsb-messages mailing list