[Lsb-messages] Build failure for lsbdev-cc on ia64

lsb-autobuild at freestandards.org lsb-autobuild at freestandards.org
Tue Apr 28 01:07:16 PDT 2009


This is an automated message generated when a build failure occurs

Linux fsgdev-ia64 2.6.18-6-mckinley #1 SMP Mon Feb 11 11:47:35 UTC 2008 ia64 ia64 ia64 GNU/Linux
Failed to make packages for lsbdev-cc
if test ! -e .need_config_update || test 4.0.0-4 != `cat .need_config_update`; \
  then echo 4.0.0-4 > .need_config_update; \
fi
sed -e "s#@LSBVERSION@#`echo 4.0.0`#" -e "s#@PACKAGE_RELEASE@#`echo 4`#" -e "s#@TRUELSBVERSION@#`echo 4.0`#" < lsb-build-cc.spec.sed > lsb-build-cc.spec
if [ -e /nethome/autobuild/tmp/lsb-build-cc-4.0.0 ]; then rm -rf /nethome/autobuild/tmp/lsb-build-cc-4.0.0; fi
bzr export --revision=-1 /nethome/autobuild/tmp/lsb-build-cc-4.0.0 http://bzr.freestandards.org/lsb/devel/build_env
cp -pr README Licence /nethome/autobuild/tmp/lsb-build-cc-4.0.0
grep LIB64 ../Makefile.common > /nethome/autobuild/tmp/lsb-build-cc-4.0.0/Makefile
cat Makefile.build >> /nethome/autobuild/tmp/lsb-build-cc-4.0.0/Makefile
cd /nethome/autobuild/tmp/lsb-build-cc-4.0.0/.. && \
tar -cz lsb-build-cc-4.0.0 > /nethome/autobuild/tmp/lsb_autobuild.3925/packaging/lsbdev-cc/lsb-build-cc-4.0.0.tar.gz && \
rm -rf /nethome/autobuild/tmp/lsb-build-cc-4.0.0
spawn rpmbuild --sign --rcfile /usr/lib/rpm/rpmrc:../rpmrc --define=_sourcedir /nethome/autobuild/tmp/lsb_autobuild.3925/packaging/lsbdev-cc --define=buildroot /nethome/autobuild/tmp/lsb-build-cc-4.0.0 --define=_topdir /nethome/autobuild/tmp/rpm-build --define=_target_cpu ia64 -ba lsb-build-cc.spec
Enter pass phrase: 
Pass phrase is good.
Executing(%prep): /bin/sh -e /var/tmp/rpm-tmp.13166
+ umask 022
+ cd /nethome/autobuild/tmp/rpm-build/BUILD
+ cd /nethome/autobuild/tmp/rpm-build/BUILD
+ rm -rf lsb-build-cc-4.0.0
+ /usr/bin/gzip -dc /nethome/autobuild/tmp/lsb_autobuild.3925/packaging/lsbdev-cc/lsb-build-cc-4.0.0.tar.gz
+ tar -xf -
+ STATUS=0
+ '[' 0 -ne 0 ']'
+ cd lsb-build-cc-4.0.0
+ exit 0
Executing(%build): /bin/sh -e /var/tmp/rpm-tmp.93179
+ umask 022
+ cd /nethome/autobuild/tmp/rpm-build/BUILD
+ cd lsb-build-cc-4.0.0
+ make LSBVERSION=4.0.0 LSBLIBCHK_VERSION=4.0.0-4
make[1]: Entering directory `/nethome/autobuild/tmp/rpm-build/BUILD/lsb-build-cc-4.0.0'
cd lsbdev-cc && make 
make[2]: Entering directory `/nethome/autobuild/tmp/rpm-build/BUILD/lsb-build-cc-4.0.0/lsbdev-cc'
cc -g -Wall   -c -o lsbcc.o lsbcc.c
cc -g -Wall   -c -o lsbcc_argv.o lsbcc_argv.c
cc -g -Wall   -c -o elf_utils.o elf_utils.c
cc   lsbcc.o lsbcc_argv.o elf_utils.o   -o lsbcc
rm -f lsbc++
ln -s lsbcc lsbc++
cc -g -Wall   -c -o lsbcpp.o lsbcpp.c
cc   lsbcpp.o lsbcc_argv.o elf_utils.o   -o lsbcpp
g++ -g -Wall -fPIC -c gcc34-compat.cc
ar rcs libgcc34compat.a gcc34-compat.o
cc -g -Wall   -c -o besteffort.o besteffort.c
make[2]: Leaving directory `/nethome/autobuild/tmp/rpm-build/BUILD/lsb-build-cc-4.0.0/lsbdev-cc'
make[1]: Leaving directory `/nethome/autobuild/tmp/rpm-build/BUILD/lsb-build-cc-4.0.0'
+ mv lsbdev-cc/lsbcc .
+ mv lsbdev-cc/lsbc++ .
+ make clean
make[1]: Entering directory `/nethome/autobuild/tmp/rpm-build/BUILD/lsb-build-cc-4.0.0'
cd lsbdev-cc && make clean
make[2]: Entering directory `/nethome/autobuild/tmp/rpm-build/BUILD/lsb-build-cc-4.0.0/lsbdev-cc'
rm -f lsbcc lsbc++ lsbcpp libgcc34compat.a *.o
make[2]: Leaving directory `/nethome/autobuild/tmp/rpm-build/BUILD/lsb-build-cc-4.0.0/lsbdev-cc'
make[1]: Leaving directory `/nethome/autobuild/tmp/rpm-build/BUILD/lsb-build-cc-4.0.0'
+ make CC=../lsbcc CXX=../lsbc++ LSBVERSION=4.0.0 LSBLIBCHK_VERSION=4.0.0-4 LSBCC_LSBVERSION=3.0
make[1]: Entering directory `/nethome/autobuild/tmp/rpm-build/BUILD/lsb-build-cc-4.0.0'
cd lsbdev-cc && make 
make[2]: Entering directory `/nethome/autobuild/tmp/rpm-build/BUILD/lsb-build-cc-4.0.0/lsbdev-cc'
../lsbcc -g -Wall   -c -o lsbcc.o lsbcc.c
lsbcc.c: In function 'perform_libtool_fixups':
lsbcc.c:242: warning: 'basename' is deprecated (declared at /opt/lsb/include/libgen.h:29)
lsbcc.c: In function 'main':
lsbcc.c:910: warning: 'basename' is deprecated (declared at /opt/lsb/include/libgen.h:29)
lsbcc.c:1448: warning: 'basename' is deprecated (declared at /opt/lsb/include/libgen.h:29)
lsbcc.c:1449: warning: 'basename' is deprecated (declared at /opt/lsb/include/libgen.h:29)
lsbcc.c:1462: warning: 'basename' is deprecated (declared at /opt/lsb/include/libgen.h:29)
lsbcc.c:1463: warning: 'basename' is deprecated (declared at /opt/lsb/include/libgen.h:29)
lsbcc.c:1620: warning: 'basename' is deprecated (declared at /opt/lsb/include/libgen.h:29)
../lsbcc -g -Wall   -c -o lsbcc_argv.o lsbcc_argv.c
../lsbcc -g -Wall   -c -o elf_utils.o elf_utils.c
../lsbcc   lsbcc.o lsbcc_argv.o elf_utils.o   -o lsbcc
lsbcc.o: In function `process_opt_l':
/nethome/autobuild/tmp/rpm-build/BUILD/lsb-build-cc-4.0.0/lsbdev-cc/lsbcc.c:177: undefined reference to `stderr'
/nethome/autobuild/tmp/rpm-build/BUILD/lsb-build-cc-4.0.0/lsbdev-cc/lsbcc.c:177: undefined reference to `stderr'
/nethome/autobuild/tmp/rpm-build/BUILD/lsb-build-cc-4.0.0/lsbdev-cc/lsbcc.c:180: undefined reference to `stderr'
/nethome/autobuild/tmp/rpm-build/BUILD/lsb-build-cc-4.0.0/lsbdev-cc/lsbcc.c:180: undefined reference to `stderr'
lsbcc.o: In function `perform_libtool_fixups':
/nethome/autobuild/tmp/rpm-build/BUILD/lsb-build-cc-4.0.0/lsbdev-cc/lsbcc.c:245: undefined reference to `stderr'
lsbcc.o:/nethome/autobuild/tmp/rpm-build/BUILD/lsb-build-cc-4.0.0/lsbdev-cc/lsbcc.c:245: more undefined references to `stderr' follow
lsbcc.o: In function `main':
/nethome/autobuild/tmp/rpm-build/BUILD/lsb-build-cc-4.0.0/lsbdev-cc/lsbcc.c:940: undefined reference to `optind'
/nethome/autobuild/tmp/rpm-build/BUILD/lsb-build-cc-4.0.0/lsbdev-cc/lsbcc.c:940: undefined reference to `optind'
/nethome/autobuild/tmp/rpm-build/BUILD/lsb-build-cc-4.0.0/lsbdev-cc/lsbcc.c:941: undefined reference to `opterr'
/nethome/autobuild/tmp/rpm-build/BUILD/lsb-build-cc-4.0.0/lsbdev-cc/lsbcc.c:941: undefined reference to `opterr'
/nethome/autobuild/tmp/rpm-build/BUILD/lsb-build-cc-4.0.0/lsbdev-cc/lsbcc.c:952: undefined reference to `stderr'
/nethome/autobuild/tmp/rpm-build/BUILD/lsb-build-cc-4.0.0/lsbdev-cc/lsbcc.c:952: undefined reference to `stderr'
/nethome/autobuild/tmp/rpm-build/BUILD/lsb-build-cc-4.0.0/lsbdev-cc/lsbcc.c:960: undefined reference to `optind'
/nethome/autobuild/tmp/rpm-build/BUILD/lsb-build-cc-4.0.0/lsbdev-cc/lsbcc.c:960: undefined reference to `optind'
/nethome/autobuild/tmp/rpm-build/BUILD/lsb-build-cc-4.0.0/lsbdev-cc/lsbcc.c:1003: undefined reference to `stderr'
/nethome/autobuild/tmp/rpm-build/BUILD/lsb-build-cc-4.0.0/lsbdev-cc/lsbcc.c:1003: undefined reference to `stderr'
/nethome/autobuild/tmp/rpm-build/BUILD/lsb-build-cc-4.0.0/lsbdev-cc/lsbcc.c:1010: undefined reference to `stderr'
/nethome/autobuild/tmp/rpm-build/BUILD/lsb-build-cc-4.0.0/lsbdev-cc/lsbcc.c:1010: undefined reference to `stderr'
/nethome/autobuild/tmp/rpm-build/BUILD/lsb-build-cc-4.0.0/lsbdev-cc/lsbcc.c:1017: undefined reference to `stderr'
lsbcc.o:/nethome/autobuild/tmp/rpm-build/BUILD/lsb-build-cc-4.0.0/lsbdev-cc/lsbcc.c:1017: more undefined references to `stderr' follow
lsbcc.o: In function `main':
/nethome/autobuild/tmp/rpm-build/BUILD/lsb-build-cc-4.0.0/lsbdev-cc/lsbcc.c:1152: undefined reference to `opterr'
/nethome/autobuild/tmp/rpm-build/BUILD/lsb-build-cc-4.0.0/lsbdev-cc/lsbcc.c:1152: undefined reference to `opterr'
/nethome/autobuild/tmp/rpm-build/BUILD/lsb-build-cc-4.0.0/lsbdev-cc/lsbcc.c:1159: undefined reference to `stderr'
/nethome/autobuild/tmp/rpm-build/BUILD/lsb-build-cc-4.0.0/lsbdev-cc/lsbcc.c:1159: undefined reference to `stderr'
/nethome/autobuild/tmp/rpm-build/BUILD/lsb-build-cc-4.0.0/lsbdev-cc/lsbcc.c:1162: undefined reference to `stderr'
/nethome/autobuild/tmp/rpm-build/BUILD/lsb-build-cc-4.0.0/lsbdev-cc/lsbcc.c:1162: undefined reference to `stderr'
/nethome/autobuild/tmp/rpm-build/BUILD/lsb-build-cc-4.0.0/lsbdev-cc/lsbcc.c:1164: undefined reference to `stderr'
lsbcc.o:/nethome/autobuild/tmp/rpm-build/BUILD/lsb-build-cc-4.0.0/lsbdev-cc/lsbcc.c:1164: more undefined references to `stderr' follow
lsbcc.o: In function `main':
/nethome/autobuild/tmp/rpm-build/BUILD/lsb-build-cc-4.0.0/lsbdev-cc/lsbcc.c:1285: undefined reference to `optind'
/nethome/autobuild/tmp/rpm-build/BUILD/lsb-build-cc-4.0.0/lsbdev-cc/lsbcc.c:1285: undefined reference to `optind'
/nethome/autobuild/tmp/rpm-build/BUILD/lsb-build-cc-4.0.0/lsbdev-cc/lsbcc.c:1291: undefined reference to `stderr'
/nethome/autobuild/tmp/rpm-build/BUILD/lsb-build-cc-4.0.0/lsbdev-cc/lsbcc.c:1291: undefined reference to `stderr'
/nethome/autobuild/tmp/rpm-build/BUILD/lsb-build-cc-4.0.0/lsbdev-cc/lsbcc.c:1297: undefined reference to `stderr'
/nethome/autobuild/tmp/rpm-build/BUILD/lsb-build-cc-4.0.0/lsbdev-cc/lsbcc.c:1297: undefined reference to `stderr'
/nethome/autobuild/tmp/rpm-build/BUILD/lsb-build-cc-4.0.0/lsbdev-cc/lsbcc.c:1303: undefined reference to `stderr'
lsbcc.o:/nethome/autobuild/tmp/rpm-build/BUILD/lsb-build-cc-4.0.0/lsbdev-cc/lsbcc.c:1303: more undefined references to `stderr' follow
lsbcc.o: In function `main':
/nethome/autobuild/tmp/rpm-build/BUILD/lsb-build-cc-4.0.0/lsbdev-cc/lsbcc.c:1328: undefined reference to `optind'
/nethome/autobuild/tmp/rpm-build/BUILD/lsb-build-cc-4.0.0/lsbdev-cc/lsbcc.c:1328: undefined reference to `optind'
/nethome/autobuild/tmp/rpm-build/BUILD/lsb-build-cc-4.0.0/lsbdev-cc/lsbcc.c:1328: undefined reference to `optind'
/nethome/autobuild/tmp/rpm-build/BUILD/lsb-build-cc-4.0.0/lsbdev-cc/lsbcc.c:1328: undefined reference to `optind'
/nethome/autobuild/tmp/rpm-build/BUILD/lsb-build-cc-4.0.0/lsbdev-cc/lsbcc.c:1336: undefined reference to `optind'
lsbcc.o:/nethome/autobuild/tmp/rpm-build/BUILD/lsb-build-cc-4.0.0/lsbdev-cc/lsbcc.c:1336: more undefined references to `optind' follow
lsbcc.o: In function `main':
/nethome/autobuild/tmp/rpm-build/BUILD/lsb-build-cc-4.0.0/lsbdev-cc/lsbcc.c:1359: undefined reference to `stderr'
/nethome/autobuild/tmp/rpm-build/BUILD/lsb-build-cc-4.0.0/lsbdev-cc/lsbcc.c:1359: undefined reference to `stderr'
/nethome/autobuild/tmp/rpm-build/BUILD/lsb-build-cc-4.0.0/lsbdev-cc/lsbcc.c:1360: undefined reference to `optind'
/nethome/autobuild/tmp/rpm-build/BUILD/lsb-build-cc-4.0.0/lsbdev-cc/lsbcc.c:1360: undefined reference to `optind'
/nethome/autobuild/tmp/rpm-build/BUILD/lsb-build-cc-4.0.0/lsbdev-cc/lsbcc.c:1375: undefined reference to `optind'
/nethome/autobuild/tmp/rpm-build/BUILD/lsb-build-cc-4.0.0/lsbdev-cc/lsbcc.c:1375: undefined reference to `optind'
/nethome/autobuild/tmp/rpm-build/BUILD/lsb-build-cc-4.0.0/lsbdev-cc/lsbcc.c:1384: undefined reference to `stderr'
/nethome/autobuild/tmp/rpm-build/BUILD/lsb-build-cc-4.0.0/lsbdev-cc/lsbcc.c:1384: undefined reference to `stderr'
/nethome/autobuild/tmp/rpm-build/BUILD/lsb-build-cc-4.0.0/lsbdev-cc/lsbcc.c:1408: undefined reference to `optind'
/nethome/autobuild/tmp/rpm-build/BUILD/lsb-build-cc-4.0.0/lsbdev-cc/lsbcc.c:1408: undefined reference to `optind'
/nethome/autobuild/tmp/rpm-build/BUILD/lsb-build-cc-4.0.0/lsbdev-cc/lsbcc.c:1424: undefined reference to `stderr'
/nethome/autobuild/tmp/rpm-build/BUILD/lsb-build-cc-4.0.0/lsbdev-cc/lsbcc.c:1424: undefined reference to `stderr'
/nethome/autobuild/tmp/rpm-build/BUILD/lsb-build-cc-4.0.0/lsbdev-cc/lsbcc.c:1424: undefined reference to `optind'
/nethome/autobuild/tmp/rpm-build/BUILD/lsb-build-cc-4.0.0/lsbdev-cc/lsbcc.c:1424: undefined reference to `optind'
/nethome/autobuild/tmp/rpm-build/BUILD/lsb-build-cc-4.0.0/lsbdev-cc/lsbcc.c:1424: undefined reference to `optopt'
/nethome/autobuild/tmp/rpm-build/BUILD/lsb-build-cc-4.0.0/lsbdev-cc/lsbcc.c:1424: undefined reference to `optopt'
/nethome/autobuild/tmp/rpm-build/BUILD/lsb-build-cc-4.0.0/lsbdev-cc/lsbcc.c:1424: undefined reference to `optopt'
/nethome/autobuild/tmp/rpm-build/BUILD/lsb-build-cc-4.0.0/lsbdev-cc/lsbcc.c:1424: undefined reference to `optopt'
/nethome/autobuild/tmp/rpm-build/BUILD/lsb-build-cc-4.0.0/lsbdev-cc/lsbcc.c:1427: undefined reference to `optopt'
lsbcc.o:/nethome/autobuild/tmp/rpm-build/BUILD/lsb-build-cc-4.0.0/lsbdev-cc/lsbcc.c:1427: more undefined references to `optopt' follow
lsbcc.o: In function `main':
/nethome/autobuild/tmp/rpm-build/BUILD/lsb-build-cc-4.0.0/lsbdev-cc/lsbcc.c:1427: undefined reference to `optind'
/nethome/autobuild/tmp/rpm-build/BUILD/lsb-build-cc-4.0.0/lsbdev-cc/lsbcc.c:1427: undefined reference to `optind'
/nethome/autobuild/tmp/rpm-build/BUILD/lsb-build-cc-4.0.0/lsbdev-cc/lsbcc.c:1428: undefined reference to `optind'
/nethome/autobuild/tmp/rpm-build/BUILD/lsb-build-cc-4.0.0/lsbdev-cc/lsbcc.c:1428: undefined reference to `optind'
/nethome/autobuild/tmp/rpm-build/BUILD/lsb-build-cc-4.0.0/lsbdev-cc/lsbcc.c:1430: undefined reference to `stderr'
/nethome/autobuild/tmp/rpm-build/BUILD/lsb-build-cc-4.0.0/lsbdev-cc/lsbcc.c:1430: undefined reference to `stderr'
/nethome/autobuild/tmp/rpm-build/BUILD/lsb-build-cc-4.0.0/lsbdev-cc/lsbcc.c:1430: undefined reference to `optind'
/nethome/autobuild/tmp/rpm-build/BUILD/lsb-build-cc-4.0.0/lsbdev-cc/lsbcc.c:1430: undefined reference to `optind'
/nethome/autobuild/tmp/rpm-build/BUILD/lsb-build-cc-4.0.0/lsbdev-cc/lsbcc.c:1465: undefined reference to `stderr'
/nethome/autobuild/tmp/rpm-build/BUILD/lsb-build-cc-4.0.0/lsbdev-cc/lsbcc.c:1465: undefined reference to `stderr'
/nethome/autobuild/tmp/rpm-build/BUILD/lsb-build-cc-4.0.0/lsbdev-cc/lsbcc.c:1489: undefined reference to `optind'
/nethome/autobuild/tmp/rpm-build/BUILD/lsb-build-cc-4.0.0/lsbdev-cc/lsbcc.c:1489: undefined reference to `optind'
/nethome/autobuild/tmp/rpm-build/BUILD/lsb-build-cc-4.0.0/lsbdev-cc/lsbcc.c:1492: undefined reference to `stderr'
/nethome/autobuild/tmp/rpm-build/BUILD/lsb-build-cc-4.0.0/lsbdev-cc/lsbcc.c:1492: undefined reference to `stderr'
/nethome/autobuild/tmp/rpm-build/BUILD/lsb-build-cc-4.0.0/lsbdev-cc/lsbcc.c:1496: undefined reference to `stderr'
/nethome/autobuild/tmp/rpm-build/BUILD/lsb-build-cc-4.0.0/lsbdev-cc/lsbcc.c:1496: undefined reference to `stderr'
/nethome/autobuild/tmp/rpm-build/BUILD/lsb-build-cc-4.0.0/lsbdev-cc/lsbcc.c:1496: undefined reference to `optind'
/nethome/autobuild/tmp/rpm-build/BUILD/lsb-build-cc-4.0.0/lsbdev-cc/lsbcc.c:1496: undefined reference to `optind'
/nethome/autobuild/tmp/rpm-build/BUILD/lsb-build-cc-4.0.0/lsbdev-cc/lsbcc.c:1498: undefined reference to `optind'
/nethome/autobuild/tmp/rpm-build/BUILD/lsb-build-cc-4.0.0/lsbdev-cc/lsbcc.c:1498: undefined reference to `optind'
/nethome/autobuild/tmp/rpm-build/BUILD/lsb-build-cc-4.0.0/lsbdev-cc/lsbcc.c:1498: undefined reference to `optind'
lsbcc.o:/nethome/autobuild/tmp/rpm-build/BUILD/lsb-build-cc-4.0.0/lsbdev-cc/lsbcc.c:1498: more undefined references to `optind' follow
lsbcc.o: In function `main':
/nethome/autobuild/tmp/rpm-build/BUILD/lsb-build-cc-4.0.0/lsbdev-cc/lsbcc.c:1501: undefined reference to `stderr'
/nethome/autobuild/tmp/rpm-build/BUILD/lsb-build-cc-4.0.0/lsbdev-cc/lsbcc.c:1501: undefined reference to `stderr'
/nethome/autobuild/tmp/rpm-build/BUILD/lsb-build-cc-4.0.0/lsbdev-cc/lsbcc.c:1516: undefined reference to `stderr'
/nethome/autobuild/tmp/rpm-build/BUILD/lsb-build-cc-4.0.0/lsbdev-cc/lsbcc.c:1516: undefined reference to `stderr'
/nethome/autobuild/tmp/rpm-build/BUILD/lsb-build-cc-4.0.0/lsbdev-cc/lsbcc.c:1524: undefined reference to `stderr'
lsbcc.o:/nethome/autobuild/tmp/rpm-build/BUILD/lsb-build-cc-4.0.0/lsbdev-cc/lsbcc.c:1524: more undefined references to `stderr' follow
/opt/lsb/lib-3.0/libc.so: undefined reference to `stdin at GLIBC_2.2'
/opt/lsb/lib-3.0/libc.so: undefined reference to `optopt at GLIBC_2.2'
/opt/lsb/lib-3.0/libc.so: undefined reference to `_sys_siglist at GLIBC_2.3.3'
/opt/lsb/lib-3.0/libc.so: undefined reference to `stdout at GLIBC_2.2'
/opt/lsb/lib-3.0/libc.so: undefined reference to `optind at GLIBC_2.2'
/opt/lsb/lib-3.0/libc.so: undefined reference to `stderr at GLIBC_2.2'
/opt/lsb/lib-3.0/libc.so: undefined reference to `opterr at GLIBC_2.2'
collect2: ld returned 1 exit status
make[2]: *** [lsbcc] Error 1
make[2]: Leaving directory `/nethome/autobuild/tmp/rpm-build/BUILD/lsb-build-cc-4.0.0/lsbdev-cc'
make[1]: *** [all] Error 2
make[1]: Leaving directory `/nethome/autobuild/tmp/rpm-build/BUILD/lsb-build-cc-4.0.0'
error: Bad exit status from /var/tmp/rpm-tmp.93179 (%build)


RPM build errors:
    Bad exit status from /var/tmp/rpm-tmp.93179 (%build)
expect: spawn id exp3 not open
    while executing
"expect "exit 0""
send: spawn id exp3 not open
    while executing
"send "\n""
mv: cannot stat `/nethome/autobuild/tmp/rpm-build/RPMS/ia64/lsb-build-cc-4.0.0-4.ia64.rpm': No such file or directory
make: *** [lsb-build-cc-4.0.0-4.ia64.rpm] Error 1


More information about the lsb-messages mailing list